{"text_format":"1","workbook":"xlsx","n_sheets":6,"sheets":["Poročilo o izvedenem tekmovanju","PRIJAVA","2.DL PIŠTOLA","2.DL PUŠKA","sodniki","clanice"],"not_rendered":{"charts":0,"images":0,"macros":1,"external_links":0,"defined_names":2,"comments":0,"pivot_tables":0},"unopened":[],"bounds":{"document_bytes":16777216,"sheet_cells":100000,"rows_first":2000,"rows_last":500,"rows_between":2000,"halvings":0,"cell_chars":16384,"cell_head_chars":4096},"cells_cut":0,"cells_raw":0,"read":"whole","date_system":"1900"}

{"sheet":"Poročilo o izvedenem tekmovanju","index":0,"n_rows":96,"n_cols":10,"rows_kept":96,"cut":false,"hidden":false,"merged":[[0,1,0,10],[2,1,2,10],[7,2,7,3],[7,7,7,8],[27,2,27,8],[7,5,7,6],[9,7,9,9],[17,2,17,9],[19,2,19,9],[5,2,5,9],[12,2,12,9],[13,2,13,9],[14,2,14,9],[15,2,15,9],[16,2,16,9],[18,2,18,9],[42,2,42,3],[33,2,33,8],[40,2,40,4],[37,2,37,9],[34,2,34,8]]}
[null,"ZAPISNIK"]
[]
[null,"o izvedenem tekmovanju v streljanju z zračno puško in pištolo"]
[]
[]
[null,"Izvajalec (društvo): ","Strelska družina KAMNIK, Kamnik"]
[]
[null,"Datum:","2024-10-26",null,null,"Pričetek ob:",null,"08:00:00"]
[]
[null,"Streljalo se je na (število) : ",null,10,null,"elektronskih tarč",null,"stez z nosilci papirnatih tarč"]
[]
[]
[null,"Sodelujoča društva: ","Strelsko društvo DOMŽALE, Domžale"]
[null,null,"Strelska družina KAMNIK, Kamnik"]
[null,null,"Strelsko društvo TRZIN, Trzin"]
[null,null,"Strelsko društvo ŠKOFJA LOKA, Škofja Loka"]
[null,null,"Strelsko društvo GORENJA VAS, Gorenja vas"]
[null,null,"Strelsko društvo Lotrič ŽELEZNIKI, Železniki"]
[null,null,"Strelsko društvo PREDDVOR, Preddvor"]
[]
[]
[null,"Posebnosti:"]
[]
[]
[]
[]
[]
[null,"Glavni sodnik : ","ZORE Franc ,  RS  , P01968"]
[]
[null,"potrjujem, da je tekmovanje izvedeno v skladu s Pravilnikom o tekmovanju za Pokal prijateljstva SZS. "]
[null,"Doseženi rezultati so resnični in pravilni."]
[]
[]
[null,"Sodnik:","SERŠA Pavel ,  RS  , P02020"]
[null,"Sodnik:","ZORE Franc ,  RS  , P01968"]
[]
[]
[null,"Vodja tekmovanja: ","RADEJ Roman"]
[]
[]
[null,"V (kraj):","Kamnik"]
[]
[null,"Datum:","2024-10-26"]
[]
[]
[null,null,null,null,null,null,null,null,null,"Obr.: 17.10.2023"]
[]
[]
[]
[null,"OPOMNIK ZA IZVEDBO TEKMOVANJA"]
[]
[null,"Tekmovanje s serijsko zračno puško za Pokal prijateljstva SZS v kategorijah U11, U13 in U15 se izvaja"]
[null,"po regijah. Lahko se izvede na več streliščih, pogoj je, da sta prisotni vsaj dve društvi."]
[null,"Datume in izvajalce za posamezna društva  določi regijska komisija."]
[null,"Vsak izvajalec pošlje rezultate v excelu sam in se ne združujejo po regijah. Najkasneje  do 11.ure v soboto"]
[null,"v tednu tekme po koledarju tekmovanj se pošljejo po e-mailu na: rezultatiszs@gmail.com"]
[null,"Dokument se shrani pod imenom kratice izvajalca, datuma tekme in krog (SVE20231024-1.krog)"]
[]
[null,"Tekmovanje sodi sodnik z veljavno licenco. Organizator zagotovi pravila ISSF, Pravilnik o tekmovanju za"]
[null,"pokal prijateljstva SZS, štartno listo in morebiti pripravi seznam za elektronske tarče."]
[]
[null,"Prijava tekmovalcev"]
[null,"Odprta bo ePrijava do petka v tednu pred tekmo. Članice zveze svoje registrirane tekmovalce prijavijo"]
[null,"preko ePrijave v ustrezno starostno kategorijo. Opozarjamo na pravilno prijavo, saj kasneje prehod "]
[null,"med starostnimi kategorijami ni dovoljen. Prav tako opozarjamo na najnižjo dovoljeno starost."]
[null,"Zelo pomembna je pravilna identifikacija z BIB, saj se ob morebiti ročno izpisani napačni številki rezultat"]
[null,"pripiše drugemu tekmovalcu. "]
[]
[null,"Tekmovalca, ki še ni registriran zabeležite v seznam \"ePrijava in Navodila\" ter mu določite začasno BIB z"]
[null,"vpisom tudi rojstnega podatka. Nastop takšnega tekmovalca je potrebno prijaviti organizatorju preko maila "]
[null,"zaradi izdelave časovnice. Neregistriran tekmovalec ima lahko samo dva nastopa, pred tretjim zaporednim "]
[null,"turnirjem  mora biti registriran sicer se briše iz skupnih rezultatov."]
[]
[null,"Izdelava štartne liste"]
[null,"Ob zaključku ePrijave vsak organizator iz spletne strani kopira vse prijavljene tekmovalce in jih prilepi v seznam "]
[null,"ePrijava in Navodila. Nato na seznamu, mogoče v stolpcu K v seznamu označi z \"1\" tekmovalce, ki bodo tekmovali "]
[null,"pri njemu, jih razvrsti in tako dobi vse na vrh liste. Nato določi skupino in strelsko mesto. "]
[]
[null,"Izpolnitev obrazca za rezultate"]
[null,"Po starostnih kategorijah se iz seznama kopira ali pripiše v seznam za rezultate samo BIB pri moških oz. ženskih "]
[null,"tekmovalcih (paziti, da je vpisan pod pravilni spol). Ostale podatke prenese samodejno, vpišemo samo še rezultate. Enako je"]
[null,"za ekipna tekmovanja. Vpiše se samo BIB tekmovalca, ki je v ekipi, ostalo samodejno."]
[null,"Pri ocenjevanju na elektronskih tarčah se vpišejo tudi nc*."]
[null,"V kolikor tekmovalca nimate v seznamu ePrijava in Navodila ga ne morete vpisat v seznam za rezultate."]
[]
[]
[null,"Obstaja možnost, da se bo obrazec nadgrajeval, zato to spremljajte posodobitve  na spletu SZS v Obvestilih SZS"]
[null,"https://strelska-zveza.si/sl/informacije/55-obvestila-szs/323-drzavne-lige-z-zracnim-orozjem-2023-2024.html"]
[]
[null,"Z izpolnjenim seznamom rokujte v skladu z zakonom, saj vsebuje osebne podatke. Letnice rojstva se v "]
[null,"biltenih tekmovanj ne prikažejo, za izvajalca pa so pomembni zaradi razvrstitve v ustrezno kategorijo."]
[]
[null,"Rezultati (listki tiskalnika SIUS; pdf izpis rezultata elektronske tarče; papirnate tarče, časovnica...) se pri izvajalcu "]
[null,"arhivirajo zaradi potrebe po naknadni kontroli ali nadzoru."]
[]
[null,"Vodje ekip so dolžni pri organizatorju preveriti končne rezultate in pravilen vpis v ustrezno starostno  kategorijo ."]

{"sheet":"PRIJAVA","index":1,"n_rows":175,"n_cols":15,"rows_kept":175,"cut":false,"hidden":false,"merged":[[31,1,31,9],[31,12,31,13],[0,0,0,14]]}
["TEKMOVANJE: 2.DL, GSL, 4. SZ REGIJA"]
[]
[null,null,"ČASOVNICA",null,null,null,null,"DNE: 17.10, 24.10. in 26.10.2024","STRELIŠČE KAMNIK",null,null,null,"Strelov",null,"KATEGORIJA IN DISCIPLINA"]
[null,null,"DAN STRELJANJA","SKUPINA","KLIC","PRIPR. IN POSK. ČAS","START","STOP","SKUPAJ V SKUPINI"]
[null,null,"četrtek 17.10.",1,"16.50","17.00","17.15","17.40",10,null,null,null,20,null,"U11 MLAJŠI DEČKI - SERIJSKA PUŠKA"]
[null,null,"četrtek 17.10.",2,"17.50","18.00","18.15","18.40","10",null,null,null,20,null,"U11 MLAJŠE DEKLICE - SERIJSKA PUŠKA"]
[null,null,"četrtek 17.10.",3,"18.50","19.00","19.15","19.40","6",null,null,null,20,null,"U13 DEČKI - SERIJSKA PUŠKA"]
[null,null,null,null,null,null,null,null,null,null,null,null,20,null,"U13 DEKLICE - SERIJSKA PUŠKA"]
[null,null,"četrtek 24.10.",1,"13.35","13.45","14.00","14.50","2",null,null,null,20,null,"U15 STAREJŠI DEČKI - SERIJSKA PUŠKA"]
[null,null,"četrtek 24.10.",2,"16.00","16.10","16.25","17.15","8",null,null,null,20,null,"U15 STAREJŠE DEKLICE - SERIJSKA PUŠKA"]
[null,null,"četrtek 24.10.",3,"17.25","17.35","17.50","18.40","7",null,null,null,20,null,"U15 STAREJŠI DEČKI - PUŠKA"]
[null,null,"četrtek 24.10.",4,"18.50","19.00","19.15","20.05","10",null,null,null,20,null,"U15 STAREJŠE DEKLICE - PUŠKA"]
[null,null,null,null,null,null,null,null,null,null,null,null,20,null,"U15 STAREJŠI DEČKI - PIŠTOLA"]
[null,null,"sobota 26.10.",5,"8.00","8.10","8.25","9.15","8",null,null,null,20,null,"U15 STAREJŠE DEKLICE - PIŠTOLA"]
[null,null,"sobota 26.10.",6,"9.25","9.35","9.50","10.40","9",null,null,null,40,null,"U17 KADETI - PUŠKA"]
[null,null,"sobota 26.10.",7,"10.50","11.00","11.15","12.05","8",null,null,null,40,null,"U17 KADETINJE - PUŠKA"]
[null,null,"sobota 26.10.",8,"12.15","12.25","12.40","13.30","9",null,null,null,40,null,"U17 KADETI - PIŠTOLA"]
[null,null,"sobota 26.10.",9,"13.40","13.50","14.05","14.55","9",null,null,null,40,null,"U17 KADETINJE - PIŠTOLA"]
[null,null,"sobota 26.10.",10,"15.05","15.15","15.30","16.20","8",null,null,null,40,null,"U21 MLADINCI - PUŠKA"]
[null,null,"sobota 26.10.",11,"16.30","16.40","16.55","17.45","7",null,null,null,40,null,"U21 MLADINKE - PUŠKA"]
[null,null,null,null,null,null,null,null,null,null,null,null,40,null,"U21 MLADINCI - PIŠTOLA"]
[null,null,null,null,null,null,null,null,null,null,null,null,40,null,"U21 MLADINKE - PIŠTOLA"]
[null,null,null,null,null,null,null,null,null,null,null,null,40,null,"ČLANI - PUŠKA"]
[null,null,null,null,null,null,null,null,null,null,null,null,40,null,"ČLANICE - PUŠKA"]
[null,null,null,null,null,null,null,null,null,null,null,null,40,null,"ČLANI - PIŠTOLA"]
[null,null,null,null,null,null,null,null,null,null,null,null,40,null,"ČLANICE - PIŠTOLA"]
[null,null,null,null,null,null,null,null,null,null,null,null,20,null,"VETERANI - SERIJSKA PUŠKA"]
[null,null,null,null,null,null,null,null,null,null,null,null,20,null,"VETERANKE - SERIJSKA PUŠKA"]
[null,null,null,null,null,null,null,null,null,null,null,null,20,null,"VETERANI - PIŠTOLA"]
[null,null,null,null,null,null,null,null,null,null,null,null,20,null,"VETERANKE - PIŠTOLA"]
[]
[null,"Podatki o prijavljenem tekmovalcu",null,null,null,null,null,null,null,null,null,null,"Časovnica"]
[null,"Štartna št. BIB","Priimek","Ime","Spol  M/Ž","Letnica rojstva","Kratica članice","Ime članice","Kategorija in disciplina","Ekipni nastop E","GSL","2DL","Skupina","Strelsko mesto","Kategorija in disciplina veterani, opomba"]
[]
[null,16182,"TOMŠIČ","Jakob","M",2013,"KAM","SD Kamnik","U13 DEČKI  - SERIJSKA PUŠKA",null,"GSL",null,1,1]
[null,"4U1303","ŽLINDRA","Nejc","M",2011,"KAM","SD Kamnik","U15 STAREJŠI DEČKI - SERIJSKA PUŠKA",null,"GSL",null,1,2]
[null,"4U1304","DOBOVŠEK","Jon","M",2011,"KAM","SD Kamnik","U15 STAREJŠI DEČKI - SERIJSKA PUŠKA",null,"GSL",null,1,3]
[null,"4U1505","KARAFILOVSKI","Marko","M",2012,"RAD","SD Radovljica","U15 STAREJŠI DEČKI - SERIJSKA PUŠKA",null,"GSL",null,1,4]
[null,"4U1306","JUNGIČ","Luka","M",2012,"RAD","SD Radovljica","U13 DEČKI  - SERIJSKA PUŠKA",null,"GSL",null,1,5]
[null,16016,"MEGUŠAR","Vid","M",2012,"LŽE","SD Lotrič Železniki","U13 DEČKI  - SERIJSKA PUŠKA",null,"GSL",null,1,6]
[null,16383,"BOGATAJ","Aiša","Ž",2012,"LŽE","SD Lotrič Železniki","U15 STAREJŠE DEKLICE - SERIJSKA PUŠKA",null,"GSL",null,1,7]
[null,16017,"MOHORIČ KOSEM","Nik","M",2011,"LŽE","SD Lotrič Železniki","U15 STAREJŠI DEČKI - SERIJSKA PUŠKA",null,"GSL",null,1,8]
[null,"4U1501","PREZELJ ","Aleksej","M",2010,"LŽE","SD Lotrič Železniki","U15 STAREJŠI DEČKI - SERIJSKA PUŠKA",null,"GSL",null,1,9]
[null,"4U1302","BRDNIK","Jaš","M",2012,"LŽE","SD Lotrič Železniki","U13 DEČKI  - SERIJSKA PUŠKA",null,"GSL",null,1,10]
[]
[null,16058,"GABER","Matej","M",2013,"ŠLO","SD Škofja Loka","U13 DEČKI  - SERIJSKA PUŠKA",null,"GSL",null,2,1]
[null,16604,"KUMER","Matic","M",2012,"ŠLO","SD Škofja Loka","U13 DEČKI  - SERIJSKA PUŠKA",null,"GSL",null,2,2]
[null,16602,"AMBROŽIČ","Oskar","M",2012,"ŠLO","SD Škofja Loka","U13 DEČKI  - SERIJSKA PUŠKA",null,"GSL",null,2,3]
[null,16605,"PORENTA","Oskar","M",2012,"ŠLO","SD Škofja Loka","U13 DEČKI  - SERIJSKA PUŠKA",null,"GSL",null,2,4]
[null,16473,"DOLENC","Meta","Ž",2012,"ŠLO","SD Škofja Loka","U13 DEKLICE - SERIJSKA PUŠKA",null,"GSL",null,2,5]
[null,16054,"RADANOV ZAVRL","Brin","M",2011,"ŠLO","SD Škofja Loka","U15 STAREJŠI DEČKI - SERIJSKA PUŠKA",null,"GSL",null,2,6]
[null,16361,"DOLENC","Marcel","M",2010,"ŠLO","SD Škofja Loka","U15 STAREJŠI DEČKI - SERIJSKA PUŠKA",null,"GSL",null,2,7]
[null,16037,"GREGORC","Samo","M",2010,"ŠLO","SD Škofja Loka","U15 STAREJŠI DEČKI - SERIJSKA PUŠKA",null,"GSL",null,2,8]
[null,16606,"PORENTA","Lara","Ž",2010,"ŠLO","SD Škofja Loka","U15 STAREJŠE DEKLICE - SERIJSKA PUŠKA",null,"GSL",null,2,9]
[null,"4U1307","DROLE","Bine","M",2011,"ŠLO","SD Škofja Loka","U13 DEČKI  - SERIJSKA PUŠKA",null,"GSL",null,2,10]
[]
[null,16109,"PAŠIĆ","Shamil","M",2013,"TJK","SD Triglav Javornik - Koroška Bela","U13 DEČKI  - SERIJSKA PUŠKA",null,"GSL",null,3,1]
[null,16108,"DESPOTOVIĆ","Lerina","Ž",2012,"TJK","SD Triglav Javornik - Koroška Bela","U13 DEKLICE - SERIJSKA PUŠKA",null,"GSL",null,3,2]
[null,16510,"GAUYACQ","Mael","M",2013,"GVA","SD Gorenja vas","U13 DEČKI  - SERIJSKA PUŠKA",null,"GSL",null,3,3]
[null,16151,"KOŠIR","Ema","Ž",2013,"GVA","SD Gorenja vas","U13 DEKLICE - SERIJSKA PUŠKA",null,"GSL",null,3,4]
[null,16321,"SLAK","Melisa","Ž",2013,"GVA","SD Gorenja vas","U13 DEKLICE - SERIJSKA PUŠKA",null,"GSL",null,3,5]
[null,"16423","ŠMID","Bine","M",2013,"PDD","SD Preddvor","U13 DEČKI  - SERIJSKA PUŠKA",null,"GSL",null,3,6]
[]
[null,15975,"JAKSETIČ","Tristan","M",2010,"KAM","SD Kamnik","U15 STAREJŠI DEČKI - PUŠKA","E","GSL","2DL",1,5]
[null,14398,"TONIČ","Bojan","M",1978,"KAM","SD Kamnik","ČLANI - PIŠTOLA",null,"GSL",null,1,6]
[]
[null,null,null,null,null,null,null,null,null,null,null,null,2,1]
[null,"2VET14","LEŠNJEK","Darko","M",1964,"KAM","SD Kamnik",null,null,"GSL",null,2,2,"VETERANI - SERIJSKA PUŠKA"]
[null,10182,"ZORE","Franc","M",1960,"KAM","SD Kamnik","ČLANI - PIŠTOLA",null,"GSL",null,2,3,"VETERANI - PIŠTOLA"]
[null,15972,"PIBERNIK","Klemen","M",1977,"KAM","SD Kamnik","ČLANI - PIŠTOLA",null,"GSL",null,2,4]
[null,10171,"REPIČ","Marjan","M",1956,"KAM","SD Kamnik","ČLANI - PIŠTOLA",null,"GSL",null,2,5,"VETERANI - PIŠTOLA"]
[null,16147,"PIBERNIK","Tilen","M",2006,"KAM","SD Kamnik","U21 MLADINCI - PIŠTOLA",null,"GSL",null,2,6]
[null,14658,"BRESKVAR","Patricija","Ž",2006,"KAM","SD Kamnik","U21 MLADINKE - PUŠKA",null,"GSL",null,2,7]
[null,10183,"RADEJ","Roman","M",1957,"KAM","SD Kamnik",null,null,"GSL",null,2,8,"VETERANI - SERIJSKA PUŠKA"]
[null,"2VET04","SMREKAR","Jana","Ž",1962,"KAM","SD Kamnik",null,null,"GSL",null,2,9,"VETERANKE - SERIJSKA PUŠKA"]
[null,null,null,null,null,null,null,null,null,null,null,null,2,10]
[]
[null,null,null,null,null,null,null,null,null,null,null,null,3,1]
[null,14897,"AHLIN","Veronika","Ž",2008,"KAM","SD Kamnik","U17 KADETINJE - PUŠKA","E","GSL","2DL",3,2]
[null,null,null,null,null,null,null,null,null,null,null,null,3,3]
[null,15693,"JERMOL","Gaber","M",2010,"KAM","SD Kamnik","U15 STAREJŠI DEČKI - PUŠKA",null,"GSL","2DL",3,4]
[null,null,null,null,null,null,null,null,null,null,null,null,3,5]
[null,15974,"KERN","Jakob","M",2008,"KAM","SD Kamnik","U17 KADETI - PIŠTOLA",null,"GSL",null,3,6]
[null,"2VET03","BARONIK","Jožef","M",1940,"KAM","SD Kamnik",null,null,"GSL",null,3,7,"VETERANI - SERIJSKA PUŠKA"]
[null,"2VET01","SERŠA","Pavel","M",1955,"KAM","SD Kamnik",null,null,"GSL",null,3,8,"VETERANI - SERIJSKA PUŠKA"]
[null,"2VET02","URANIČ","Renato","M",1963,"KAM","SD Kamnik",null,null,"GSL",null,3,9,"VETERANI - SERIJSKA PUŠKA"]
[null,10171,"REPIČ","Marjan","M",1956,"KAM","SD Kamnik",null,null,"GSL",null,3,10,"VETERANI - SERIJSKA PUŠKA"]
[]
[null,15984,"KALIŠNIK","Andraž","M",1994,"TRZ","SD Trzin","ČLANI - PIŠTOLA",null,"GSL","2DL",4,1]
[null,13742,"DAVIDOVIĆ","Miroslav","M",1971,"TRZ","SD Trzin","ČLANI - PIŠTOLA","E","GSL","2DL",4,2]
[null,15198,"HAFNAR","Matjaž","M",1973,"ŠLO","SD Škofja Loka","ČLANI - PIŠTOLA","E","GSL","2DL",4,3]
[null,15197,"BRENKUŠ","Matjaž","M",1967,"ŠLO","SD Škofja Loka","ČLANI - PIŠTOLA","E","GSL","2DL",4,4]
[null,16378,"ČEMAŽAR","Niko","M",1979,"LŽE","SD Lotrič Železniki","ČLANI - PIŠTOLA",null,"GSL","2DL",4,5]
[null,15650,"ČEMAŽAR","Neža","Ž",2008,"LŽE","SD Lotrič Železniki","U17 KADETINJE - PUŠKA",null,"GSL","2DL",4,6]
[null,14548,"KOBLAR","Amadej","M",2007,"LŽE","SD Lotrič Železniki","U21 MLADINCI - PUŠKA",null,"GSL","2DL",4,7]
[null,15788,"ŠUBIC","Toni","M",2007,"LŽE","SD Lotrič Železniki","U21 MLADINCI - PUŠKA",null,"GSL","2DL",4,8]
[null,"2VET12","FLANDER ","Marko","M",1962,"LŽE","SD Lotrič Železniki","ČLANI - PIŠTOLA",null,"GSL",null,4,9,"VETERANI - PIŠTOLA"]
[null,16621,"LAPAJNE ","Darka","Ž",1976,"TRZ","SD Trzin","ČLANICE - PIŠTOLA","E","GSL","2DL",4,10]
[]
[null,10365,"ŠTIFTAR","Jurij","M",1969,"DOM","SD Domžale","ČLANI - PIŠTOLA","E","GSL","2DL",5,1]
[null,10177,"DIMIC","Klemen","M",1984,"DOM","SD Domžale","ČLANI - PIŠTOLA","E","GSL","2DL",5,2]
[null,11526,"ČAUŠEVIČ","Alen","M",1992,"DOM","SD Domžale","ČLANI - PIŠTOLA","E","GSL","2DL",5,3]
[null,14068,"KECELJ","Matija","M",2002,"DOM","SD Domžale","ČLANI - PIŠTOLA",null,"GSL",null,5,4]
[null,10183,"RADEJ","Roman","M",1957,"KAM","SD Kamnik","ČLANI - PIŠTOLA",null,"GSL",null,5,5,"VETERANI - PIŠTOLA"]
[null,null,null,null,null,null,null,null,null,null,null,null,5,6]
[null,16215,"ZUPIN","Nejc","M",2009,"PDD","SD Preddvor","U17 KADETI - PUŠKA","E","GSL","2DL",5,7]
[null,15983,"GAŠPERLIN","Lana","Ž",2008,"PDD","SD Preddvor","U17 KADETINJE - PUŠKA","E","GSL","2DL",5,8]
[null,null,null,null,null,null,null,null,null,null,null,null,5,9]
[null,13844,"RAJGELJ","Sergej","M",2005,"PDD","SD Preddvor","U21 MLADINCI - PUŠKA","E","GSL","2DL",5,10]
[]
[null,10392,"KOŠIR","Branko","M",1964,"LŽE","SD Lotrič Železniki","ČLANI - PUŠKA",null,"GSL",null,6,1]
[null,14863,"AHAČIČ SREDNIK","Nika","Ž",1960,"LŽE","SD Lotrič Železniki","ČLANICE - PUŠKA",null,"GSL","2DL",6,2]
[null,"2VET06","RADEJ","Irena","Ž",1959,"KAM","SD Kamnik",null,null,"GSL",null,6,3,"VETERANKE - SERIJSKA PUŠKA"]
[null,"2VET07","ŽORŽ","Janko","M",1953,"ŠLO","SD Škofja Loka",null,null,"GSL",null,6,4,"VETERANI - SERIJSKA PUŠKA"]
[null,"2VET08","MOHORIČ","Dimitrij","M",1960,"ŠLO","SD Škofja Loka",null,null,"GSL",null,6,5,"VETERANI - SERIJSKA PUŠKA"]
[null,"2VET09","VODOPIVEC ","Boris","M",1952,"ŠLO","SD Škofja Loka",null,null,"GSL",null,6,6,"VETERANI - SERIJSKA PUŠKA"]
[null,10294,"PETERNELJ","Henrik","M",1941,"ŠLO","SD Škofja Loka",null,null,"GSL",null,6,7,"VETERANI - SERIJSKA PUŠKA"]
[null,"2VET10","DEMŠAR ","Janko","M",1948,"ŠLO","SD Škofja Loka",null,null,"GSL",null,6,8,"VETERANI - SERIJSKA PUŠKA"]
[null,"2VET11","KOČAR ","Adi","M",1941,"ŠLO","SD Škofja Loka",null,null,"GSL",null,6,9,"VETERANI - PIŠTOLA"]
[null,"2VET05","HRIBAR","Marija","Ž",1955,"KAM","SD Kamnik",null,null,"GSL",null,6,10,"VETERANKE - SERIJSKA PUŠKA"]
[]
[null,10294,"PETERNELJ","Henrik","M",1941,"ŠLO","SD Škofja Loka","ČLANI - PIŠTOLA","E","GSL","2DL",7,1,"VETERANI - PIŠTOLA"]
[null,16229,"GRAŠIČ","Lovro","M",2008,"ŠLO","SD Škofja Loka","U17 KADETI - PUŠKA","E","GSL","2DL",7,2]
[null,14600,"GABER","Luka","M",2008,"ŠLO","SD Škofja Loka","U17 KADETI - PUŠKA","E","GSL","2DL",7,3]
[null,14599,"KOPRIVNIKAR","Žiga","M",2008,"ŠLO","SD Škofja Loka","U17 KADETI - PUŠKA","E","GSL","2DL",7,4]
[null,14401,"AHLIN","Domen","M",2005,"KAM","SD Kamnik","U21 MLADINCI - PIŠTOLA",null,"GSL",null,7,5]
[null,null,null,null,null,null,null,null,null,null,null,null,7,6]
[null,16277,"CEGNAR","Ema","Ž",2011,"ŠLO","SD Škofja Loka","U15 STAREJŠE DEKLICE - PIŠTOLA",null,"GSL",null,7,7]
[null,10694,"MATAN","Nuša","Ž",null,"TRZ","SD Trzin","ČLANICE - PIŠTOLA",null,"GSL","2DL",7,8,"DNS, prekinila streljanje"]
[null,13598,"BORC","Urška","Ž",null,"TRZ","SD Trzin","ČLANICE - PIŠTOLA",null,"GSL","2DL",7,9]
[null,10392,"KOŠIR","Branko","M",1964,"LŽE","SD Lotrič Železniki","ČLANI - PIŠTOLA","E","GSL","2DL",7,10,"VETERANI - PIŠTOLA"]
[]
[null,14863,"AHAČIČ SREDNIK","Nika","Ž",1960,"LŽE","SD Lotrič Železniki","ČLANICE - PIŠTOLA",null,"GSL","2DL",8,1,"VETERANKE - PIŠTOLA"]
[null,11172,"DOBRAVEC","Petra","Ž",1970,"LŽE","SD Lotrič Železniki","ČLANICE - PIŠTOLA",null,"GSL","2DL",8,2,"DNS - je ni bilo VETERANKE - PIŠTOLA"]
[null,null,null,null,null,null,null,null,null,null,null,null,8,3]
[null,11107,"PRELEC","Tomaž","M",1963,"LŽE","SD Lotrič Železniki","ČLANI - PIŠTOLA","E","GSL","2DL",8,4,"VETERANI - PIŠTOLA"]
[null,11132,"TOMAŠEVIČ","Klemen","M",1987,"LŽE","SD Lotrič Železniki","ČLANI - PIŠTOLA",null,"GSL",null,8,5]
[null,14902,"TOLAR","Matic","M",2009,"LŽE","SD Lotrič Železniki","U17 KADETI - PIŠTOLA",null,"GSL","2DL",8,6]
[null,14903,"TOLAR","Žiga","M",2006,"LŽE","SD Lotrič Železniki","U21 MLADINCI - PIŠTOLA","E","GSL","2DL",8,7]
[null,16128,"ZUPANC","Aleksander","M",1992,"LŽE","SD Lotrič Železniki","ČLANI - PIŠTOLA",null,"GSL","2DL",8,8]
[null,15496,"VALCL","Žare","M",2008,"LŽE","SD Lotrič Železniki","U17 KADETI - PIŠTOLA",null,"GSL",null,8,9]
[null,10645,"HABJAN ","Andreja","Ž",null,"TRZ","SD Trzin","ČLANICE - PIŠTOLA","E","GSL","2DL",8,10]
[]
[null,15648,"BENEDIČIČ","Manca","Ž",2008,"LŽE","SD Lotrič Železniki","U17 KADETINJE - PUŠKA","E","GSL","2DL",9,1]
[null,14547,"BRATINA","Jakob","M",2008,"LŽE","SD Lotrič Železniki","U17 KADETI - PUŠKA","E","GSL","2DL",9,2]
[null,16013,"HABJAN","Nuša","Ž",2009,"LŽE","SD Lotrič Železniki","U17 KADETINJE - PIŠTOLA",null,"GSL","2DL",9,3]
[null,13430,"KOŠIR","Nik","M",2005,"LŽE","SD Lotrič Železniki","U21 MLADINCI - PIŠTOLA",null,"GSL","2DL",9,4]
[null,14549,"PREZELJ","Matej","M",2007,"LŽE","SD Lotrič Železniki","U21 MLADINCI - PIŠTOLA",null,"GSL","2DL",9,5,"DNS - ga ni bilo"]
[null,null,null,null,null,null,null,null,null,null,null,null,9,6]
[null,16384,"REŽEK","Primož","M",1978,"LŽE","SD Lotrič Železniki","ČLANI - PUŠKA",null,"GSL","2DL",9,7]
[null,16129,"REŽEK","Luka","M",2007,"LŽE","SD Lotrič Železniki","U21 MLADINCI - PUŠKA",null,"GSL","2DL",9,8]
[null,15649,"ŠOLAR","Teja","Ž",2008,"LŽE","SD Lotrič Železniki","U17 KADETINJE - PUŠKA","E","GSL","2DL",9,9]
[null,null,null,null,null,null,null,null,null,null,null,null,9,10]
[]
[null,"2VET13","PRIMOŽIČ","Klemen","M",1971,"LŽE","SD Lotrič Železniki","ČLANI - PIŠTOLA",null,"GSL",null,10,1,"VETERANI - PIŠTOLA"]
[null,16014,"PRIMOŽIČ","Taja","Ž",2009,"LŽE","SD Lotrič Železniki","U17 KADETINJE - PIŠTOLA",null,"GSL","2DL",10,2]
[null,16379,"PRIMOŽIČ","Aleksandra","Ž",2010,"LŽE","SD Lotrič Železniki","U15 STAREJŠE DEKLICE - PIŠTOLA",null,"GSL",null,10,3]
[null,16380,"PRIMOŽIČ","Tajša","Ž",2012,"LŽE","SD Lotrič Železniki","U15 STAREJŠE DEKLICE - PIŠTOLA",null,"GSL",null,10,4]
[null,14210,"KLARIČ ","Denis","M",1977,"KAM","SD Kamnik","ČLANI - PIŠTOLA",null,"GSL",null,10,5]
[null,10676,"ZORE","Anže","M",1985,"KAM","SD Kamnik","ČLANI - PIŠTOLA",null,"GSL",null,10,6]
[null,10313,"FABJAN","Boštjan","M",1978,"KAM","SD Kamnik","ČLANI - PUŠKA","E","GSL","2DL",10,7]
[null,"4U1502","PRIMOŽIČ","Tia","Ž",2012,"LŽE","SD Lotrič Železniki","U15 STAREJŠE DEKLICE - PIŠTOLA",null,"GSL",null,10,8]
[null,null,null,null,null,null,null,null,null,null,null,null,10,9]
[null,null,null,null,null,null,null,null,null,null,null,null,10,10]
[]
[null,10536,"CANKAR","David","M",1970,"GVA","SD Gorenja vas","ČLANI - PIŠTOLA","E","GSL","2DL",11,1,"VETERANI - PIŠTOLA"]
[null,15608,"HUJIĆ","Meldin","M",1997,"GVA","SD Gorenja vas","ČLANI - PIŠTOLA","E","GSL","2DL",11,2]
[null,13143,"JERAM","Silva","Ž",1964,"GVA","SD Gorenja vas","ČLANICE - PIŠTOLA",null,"GSL","2DL",11,3,"VETERANKE - PIŠTOLA"]
[null,16320,"KUNC","Tilen","M",2001,"GVA","SD Gorenja vas","ČLANI - PIŠTOLA","E","GSL","2DL",11,4]
[null,13804,"JUSTIN","Olga","Ž",1975,"GVA","SD Gorenja vas","ČLANICE - PIŠTOLA",null,"GSL",null,11,5,"VETERANKE - PIŠTOLA"]
[null,15486,"SLAK","Manja","Ž",2006,"GVA","SD Gorenja vas","U21 MLADINKE - PIŠTOLA",null,"GSL",null,11,6]
[null,11227,"BOŽIČ","Gašper","M",1987,"GVA","SD Gorenja vas","ČLANI - PIŠTOLA",null,"GSL",null,11,7]
[null,null,null,null,null,null,null,null,null,null,null,null,11,8]
[null,null,null,null,null,null,null,null,null,null,null,null,11,9]
[null,null,null,null,null,null,null,null,null,null,null,null,11,10]

{"sheet":"2.DL PIŠTOLA","index":2,"n_rows":105,"n_cols":31,"rows_kept":105,"cut":false,"hidden":false,"merged":[[1,0,1,30],[3,2,3,14],[4,0,6,0],[4,1,6,1],[4,2,4,14]]}
[]
["Iz zavihka Prijava se za tekmovalca v seznam za rezultate v stolpec E vpiše BIB številka od vrstice 5 dalje. Po vpisu BIB bo preneslo vse podatke v ta seznam, kjer se nato vpisujejo rezultati. Vpiše se rezultat serije v stolpec K, L, M, N  ter nc*. Prav tako se za upoštevanje rezultata ekipno vpišejo samo BIB številke v stolpcu T za vse tri člane ekipe, ki je lahko mešana. Prenos ostalih podatkov je samodejen.  Posamezno se lahko razvrsti, ekipno ostane nerazvrščeno. Dokument mora imeti omogočen makro."]
[]
[null,null,"II. LIGA PIŠTOLA 4. SZ REGIJA"]
["mesto",null,"SD KAMNIK"]
[]
[null,null,"Priimek in ime","Roj.skrita","BIB","Društvo, klub","1. ser","2. ser","3. ser","4. ser","1. ser","2. ser","3. ser","4. ser","skupno","nc*"]
[1,null,{"$f":"IF(E8=\"\",\"\",VLOOKUP(E8,PRIJAVA!$B$35:$H$240,2,FALSE) & \" \" & VLOOKUP(E8,PRIJAVA!$B$35:$H$240,3,FALSE))","v":"HUJIĆ Meldin"},{"$f":"IF(E8=\"\",\"\",VLOOKUP(E8,PRIJAVA!$B$35:$H$240,5,FALSE))","v":1997},15608,{"$f":"IF(E8=\"\",\"\",VLOOKUP(E8,PRIJAVA!$B$35:$H$240,7,FALSE))","v":"SD Gorenja vas"},null,null,null,null,87,94,92,93,{"$f":"SUM(G8:N8)","v":366},8,{"$f":"IF(C8=\"TONIČ Bojan\",\"!\",\"\")","v":""},null,null,null,"EKIPNO: "]
[2,null,{"$f":"IF(E9=\"\",\"\",VLOOKUP(E9,PRIJAVA!$B$35:$H$240,2,FALSE) & \" \" & VLOOKUP(E9,PRIJAVA!$B$35:$H$240,3,FALSE))","v":"CANKAR David"},null,10536,{"$f":"IF(E9=\"\",\"\",VLOOKUP(E9,PRIJAVA!$B$35:$H$240,7,FALSE))","v":"SD Gorenja vas"},null,null,null,null,83,95,95,88,361,6,{"$f":"IF(C9=\"TONIČ Bojan\",\"!\",\"\")","v":""}]
[3,null,{"$f":"IF(E10=\"\",\"\",VLOOKUP(E10,PRIJAVA!$B$35:$H$240,2,FALSE) & \" \" & VLOOKUP(E10,PRIJAVA!$B$35:$H$240,3,FALSE))","v":"BRENKUŠ Matjaž"},{"$f":"IF(E10=\"\",\"\",VLOOKUP(E10,PRIJAVA!$B$35:$H$240,5,FALSE))","v":1967},15197,{"$f":"IF(E10=\"\",\"\",VLOOKUP(E10,PRIJAVA!$B$35:$H$240,7,FALSE))","v":"SD Škofja Loka"},null,null,null,null,91,87,87,95,360,5,"",null,null,null,{"$f":"IF(T12=\"\",\"\",VLOOKUP(T12,PRIJAVA!$B$35:$H$240,7,FALSE))","v":"SD Trzin"}]
[4,null,{"$f":"IF(E11=\"\",\"\",VLOOKUP(E11,PRIJAVA!$B$35:$H$240,2,FALSE) & \" \" & VLOOKUP(E11,PRIJAVA!$B$35:$H$240,3,FALSE))","v":"KALIŠNIK Andraž"},{"$f":"IF(E11=\"\",\"\",VLOOKUP(E11,PRIJAVA!$B$35:$H$240,5,FALSE))","v":1994},15984,{"$f":"IF(E11=\"\",\"\",VLOOKUP(E11,PRIJAVA!$B$35:$H$240,7,FALSE))","v":"SD Trzin"},null,null,null,null,87,90,88,92,357,3,"",null,null,"BIB","Priimek in ime","1. ser","2. ser","3. ser","4. ser","1. ser","2. ser","3. ser","4. ser","skupno","nc*"]
[5,null,{"$f":"IF(E12=\"\",\"\",VLOOKUP(E12,PRIJAVA!$B$35:$H$240,2,FALSE) & \" \" & VLOOKUP(E12,PRIJAVA!$B$35:$H$240,3,FALSE))","v":"KOŠIR Branko"},{"$f":"IF(E12=\"\",\"\",VLOOKUP(E12,PRIJAVA!$B$35:$H$240,5,FALSE))","v":1964},10392,{"$f":"IF(E12=\"\",\"\",VLOOKUP(E12,PRIJAVA!$B$35:$H$240,7,FALSE))","v":"SD Lotrič Železniki"},null,null,null,null,92,88,89,87,356,5,"",null,null,13742,{"$f":"IF(T12=\"\",\"\",VLOOKUP(T12,PRIJAVA!$B$35:$H$240,2,FALSE) & \" \" & VLOOKUP(T12,PRIJAVA!$B$35:$H$240,3,FALSE))","v":"DAVIDOVIĆ Miroslav"},{"$f":"IF(U12=\"\",\"\",VLOOKUP(U12,$C$8:$N$106,5,FALSE))","v":0},{"$f":"IF(U12=\"\",\"\",VLOOKUP(U12,$C$8:$N$106,6,FALSE))","v":0},{"$f":"IF(U12=\"\",\"\",VLOOKUP(U12,$C$8:$N$106,7,FALSE))","v":0},{"$f":"IF(U12=\"\",\"\",VLOOKUP(U12,$C$8:$N$106,8,FALSE))","v":0},{"$f":"IF(U12=\"\",\"\",VLOOKUP(U12,$C$8:$N$106,9,FALSE))","v":90},{"$f":"IF(U12=\"\",\"\",VLOOKUP(U12,$C$8:$L$106,10,FALSE))","v":85},{"$f":"IF(V12=\"\",\"\",VLOOKUP(U12,$C$8:$M$106,11,FALSE))","v":91},{"$f":"IF(U12=\"\",\"\",VLOOKUP(U12,$C$8:$N$106,12,FALSE))","v":85},{"$f":"SUM(V12:AC12)","v":351},{"$f":"IF(U12=\"\",\"\",VLOOKUP(U12,$C$8:$P$106,14,FALSE))","v":7}]
[6,null,{"$f":"IF(E13=\"\",\"\",VLOOKUP(E13,PRIJAVA!$B$35:$H$240,2,FALSE) & \" \" & VLOOKUP(E13,PRIJAVA!$B$35:$H$240,3,FALSE))","v":"HABJAN  Andreja"},{"$f":"IF(E13=\"\",\"\",VLOOKUP(E13,PRIJAVA!$B$35:$H$240,5,FALSE))","v":0},10645,{"$f":"IF(E13=\"\",\"\",VLOOKUP(E13,PRIJAVA!$B$35:$H$240,7,FALSE))","v":"SD Trzin"},null,null,null,null,84,92,90,87,353,4,"",null,null,16621,{"$f":"IF(T13=\"\",\"\",VLOOKUP(T13,PRIJAVA!$B$35:$H$240,2,FALSE) & \" \" & VLOOKUP(T13,PRIJAVA!$B$35:$H$240,3,FALSE))","v":"LAPAJNE  Darka"},{"$f":"IF(U13=\"\",\"\",VLOOKUP(U13,$C$8:$N$106,5,FALSE))","v":0},{"$f":"IF(U13=\"\",\"\",VLOOKUP(U13,$C$8:$N$106,6,FALSE))","v":0},{"$f":"IF(U13=\"\",\"\",VLOOKUP(U13,$C$8:$N$106,7,FALSE))","v":0},{"$f":"IF(U13=\"\",\"\",VLOOKUP(U13,$C$8:$N$106,8,FALSE))","v":0},{"$f":"IF(U13=\"\",\"\",VLOOKUP(U13,$C$8:$N$106,9,FALSE))","v":85},{"$f":"IF(U13=\"\",\"\",VLOOKUP(U13,$C$8:$L$106,10,FALSE))","v":91},{"$f":"IF(V13=\"\",\"\",VLOOKUP(U13,$C$8:$M$106,11,FALSE))","v":84},{"$f":"IF(U13=\"\",\"\",VLOOKUP(U13,$C$8:$N$106,12,FALSE))","v":87},{"$f":"SUM(V13:AC13)","v":347},{"$f":"IF(U13=\"\",\"\",VLOOKUP(U13,$C$8:$P$106,14,FALSE))","v":3}]
[7,null,{"$f":"IF(E14=\"\",\"\",VLOOKUP(E14,PRIJAVA!$B$35:$H$240,2,FALSE) & \" \" & VLOOKUP(E14,PRIJAVA!$B$35:$H$240,3,FALSE))","v":"ZUPANC Aleksander"},{"$f":"IF(E14=\"\",\"\",VLOOKUP(E14,PRIJAVA!$B$35:$H$240,5,FALSE))","v":1992},16128,{"$f":"IF(E14=\"\",\"\",VLOOKUP(E14,PRIJAVA!$B$35:$H$240,7,FALSE))","v":"SD Lotrič Železniki"},null,null,null,null,88,86,91,88,353,2,"",null,null,10645,{"$f":"IF(T14=\"\",\"\",VLOOKUP(T14,PRIJAVA!$B$35:$H$240,2,FALSE) & \" \" & VLOOKUP(T14,PRIJAVA!$B$35:$H$240,3,FALSE))","v":"HABJAN  Andreja"},{"$f":"IF(U14=\"\",\"\",VLOOKUP(U14,$C$8:$N$106,5,FALSE))","v":0},{"$f":"IF(U14=\"\",\"\",VLOOKUP(U14,$C$8:$N$106,6,FALSE))","v":0},{"$f":"IF(U14=\"\",\"\",VLOOKUP(U14,$C$8:$N$106,7,FALSE))","v":0},{"$f":"IF(U14=\"\",\"\",VLOOKUP(U14,$C$8:$N$106,8,FALSE))","v":0},{"$f":"IF(U14=\"\",\"\",VLOOKUP(U14,$C$8:$N$106,9,FALSE))","v":84},{"$f":"IF(U14=\"\",\"\",VLOOKUP(U14,$C$8:$L$106,10,FALSE))","v":92},{"$f":"IF(V14=\"\",\"\",VLOOKUP(U14,$C$8:$M$106,11,FALSE))","v":90},{"$f":"IF(U14=\"\",\"\",VLOOKUP(U14,$C$8:$N$106,12,FALSE))","v":87},{"$f":"SUM(V14:AC14)","v":353},{"$f":"IF(U14=\"\",\"\",VLOOKUP(U14,$C$8:$P$106,14,FALSE))","v":4}]
[8,null,{"$f":"IF(E15=\"\",\"\",VLOOKUP(E15,PRIJAVA!$B$35:$H$240,2,FALSE) & \" \" & VLOOKUP(E15,PRIJAVA!$B$35:$H$240,3,FALSE))","v":"KUNC Tilen"},{"$f":"IF(E15=\"\",\"\",VLOOKUP(E15,PRIJAVA!$B$35:$H$240,5,FALSE))","v":2001},16320,{"$f":"IF(E15=\"\",\"\",VLOOKUP(E15,PRIJAVA!$B$35:$H$240,7,FALSE))","v":"SD Gorenja vas"},null,null,null,null,88,84,90,90,352,7,"",null,null,null,null,null,null,null,null,null,null,null,{"$f":"SUM(AC12:AC14)","v":259},{"$f":"SUM(AD12:AD14)","v":1051},{"$f":"SUM(AE12:AE14)","v":14}]
[9,null,{"$f":"IF(E16=\"\",\"\",VLOOKUP(E16,PRIJAVA!$B$35:$H$240,2,FALSE) & \" \" & VLOOKUP(E16,PRIJAVA!$B$35:$H$240,3,FALSE))","v":"DAVIDOVIĆ Miroslav"},{"$f":"IF(E16=\"\",\"\",VLOOKUP(E16,PRIJAVA!$B$35:$H$240,5,FALSE))","v":1971},13742,{"$f":"IF(E16=\"\",\"\",VLOOKUP(E16,PRIJAVA!$B$35:$H$240,7,FALSE))","v":"SD Trzin"},null,null,null,null,90,85,91,85,351,7,""]
[10,null,{"$f":"IF(E17=\"\",\"\",VLOOKUP(E17,PRIJAVA!$B$35:$H$240,2,FALSE) & \" \" & VLOOKUP(E17,PRIJAVA!$B$35:$H$240,3,FALSE))","v":"PRIMOŽIČ Taja"},{"$f":"IF(E17=\"\",\"\",VLOOKUP(E17,PRIJAVA!$B$35:$H$240,5,FALSE))","v":2009},16014,{"$f":"IF(E17=\"\",\"\",VLOOKUP(E17,PRIJAVA!$B$35:$H$240,7,FALSE))","v":"SD Lotrič Železniki"},null,null,null,null,88,87,87,87,349,4,""]
[11,null,{"$f":"IF(E18=\"\",\"\",VLOOKUP(E18,PRIJAVA!$B$35:$H$240,2,FALSE) & \" \" & VLOOKUP(E18,PRIJAVA!$B$35:$H$240,3,FALSE))","v":"LAPAJNE  Darka"},{"$f":"IF(E18=\"\",\"\",VLOOKUP(E18,PRIJAVA!$B$35:$H$240,5,FALSE))","v":1976},16621,{"$f":"IF(E18=\"\",\"\",VLOOKUP(E18,PRIJAVA!$B$35:$H$240,7,FALSE))","v":"SD Trzin"},null,null,null,null,85,91,84,87,347,3,"",null,null,null,{"$f":"IF(T20=\"\",\"\",VLOOKUP(T20,PRIJAVA!$B$35:$H$240,7,FALSE))","v":"SD Škofja Loka"}]
[12,null,{"$f":"IF(E19=\"\",\"\",VLOOKUP(E19,PRIJAVA!$B$35:$H$240,2,FALSE) & \" \" & VLOOKUP(E19,PRIJAVA!$B$35:$H$240,3,FALSE))","v":"TOLAR Žiga"},{"$f":"IF(E19=\"\",\"\",VLOOKUP(E19,PRIJAVA!$B$35:$H$240,5,FALSE))","v":2006},14903,{"$f":"IF(E19=\"\",\"\",VLOOKUP(E19,PRIJAVA!$B$35:$H$240,7,FALSE))","v":"SD Lotrič Železniki"},null,null,null,null,85,86,90,85,346,5,"",null,null,"BIB","Priimek in ime","1. ser","2. ser","3. ser","4. ser","1. ser","2. ser","3. ser","4. ser","skupno","nc*"]
[13,null,{"$f":"IF(E20=\"\",\"\",VLOOKUP(E20,PRIJAVA!$B$35:$H$240,2,FALSE) & \" \" & VLOOKUP(E20,PRIJAVA!$B$35:$H$240,3,FALSE))","v":"PRELEC Tomaž"},{"$f":"IF(E20=\"\",\"\",VLOOKUP(E20,PRIJAVA!$B$35:$H$240,5,FALSE))","v":1963},11107,{"$f":"IF(E20=\"\",\"\",VLOOKUP(E20,PRIJAVA!$B$35:$H$240,7,FALSE))","v":"SD Lotrič Železniki"},null,null,null,null,81,88,83,92,344,5,"",null,null,15198,{"$f":"IF(T20=\"\",\"\",VLOOKUP(T20,PRIJAVA!$B$35:$H$240,2,FALSE) & \" \" & VLOOKUP(T20,PRIJAVA!$B$35:$H$240,3,FALSE))","v":"HAFNAR Matjaž"},{"$f":"IF(U20=\"\",\"\",VLOOKUP(U20,$C$8:$N$106,5,FALSE))","v":0},{"$f":"IF(U20=\"\",\"\",VLOOKUP(U20,$C$8:$N$106,6,FALSE))","v":0},{"$f":"IF(U20=\"\",\"\",VLOOKUP(U20,$C$8:$N$106,7,FALSE))","v":0},{"$f":"IF(U20=\"\",\"\",VLOOKUP(U20,$C$8:$N$106,8,FALSE))","v":0},{"$f":"IF(U20=\"\",\"\",VLOOKUP(U20,$C$8:$N$106,9,FALSE))","v":81},{"$f":"IF(U20=\"\",\"\",VLOOKUP(U20,$C$8:$L$106,10,FALSE))","v":74},{"$f":"IF(V20=\"\",\"\",VLOOKUP(U20,$C$8:$M$106,11,FALSE))","v":84},{"$f":"IF(U20=\"\",\"\",VLOOKUP(U20,$C$8:$N$106,12,FALSE))","v":76},{"$f":"SUM(V20:AC20)","v":315},{"$f":"IF(U20=\"\",\"\",VLOOKUP(U20,$C$8:$P$106,14,FALSE))","v":1}]
[14,null,{"$f":"IF(E21=\"\",\"\",VLOOKUP(E21,PRIJAVA!$B$35:$H$240,2,FALSE) & \" \" & VLOOKUP(E21,PRIJAVA!$B$35:$H$240,3,FALSE))","v":"JERAM Silva"},{"$f":"IF(E21=\"\",\"\",VLOOKUP(E21,PRIJAVA!$B$35:$H$240,5,FALSE))","v":1964},13143,{"$f":"IF(E21=\"\",\"\",VLOOKUP(E21,PRIJAVA!$B$35:$H$240,7,FALSE))","v":"SD Gorenja vas"},null,null,null,null,85,91,87,81,344,2,"",null,null,15197,{"$f":"IF(T21=\"\",\"\",VLOOKUP(T21,PRIJAVA!$B$35:$H$240,2,FALSE) & \" \" & VLOOKUP(T21,PRIJAVA!$B$35:$H$240,3,FALSE))","v":"BRENKUŠ Matjaž"},{"$f":"IF(U21=\"\",\"\",VLOOKUP(U21,$C$8:$N$106,5,FALSE))","v":0},{"$f":"IF(U21=\"\",\"\",VLOOKUP(U21,$C$8:$N$106,6,FALSE))","v":0},{"$f":"IF(U21=\"\",\"\",VLOOKUP(U21,$C$8:$N$106,7,FALSE))","v":0},{"$f":"IF(U21=\"\",\"\",VLOOKUP(U21,$C$8:$N$106,8,FALSE))","v":0},{"$f":"IF(U21=\"\",\"\",VLOOKUP(U21,$C$8:$N$106,9,FALSE))","v":91},{"$f":"IF(U21=\"\",\"\",VLOOKUP(U21,$C$8:$L$106,10,FALSE))","v":87},{"$f":"IF(V21=\"\",\"\",VLOOKUP(U21,$C$8:$M$106,11,FALSE))","v":87},{"$f":"IF(U21=\"\",\"\",VLOOKUP(U21,$C$8:$N$106,12,FALSE))","v":95},{"$f":"SUM(V21:AC21)","v":360},{"$f":"IF(U21=\"\",\"\",VLOOKUP(U21,$C$8:$P$106,14,FALSE))","v":5}]
[15,null,{"$f":"IF(E22=\"\",\"\",VLOOKUP(E22,PRIJAVA!$B$35:$H$240,2,FALSE) & \" \" & VLOOKUP(E22,PRIJAVA!$B$35:$H$240,3,FALSE))","v":"DIMIC Klemen"},{"$f":"IF(E22=\"\",\"\",VLOOKUP(E22,PRIJAVA!$B$35:$H$240,5,FALSE))","v":1984},10177,{"$f":"IF(E22=\"\",\"\",VLOOKUP(E22,PRIJAVA!$B$35:$H$240,7,FALSE))","v":"SD Domžale"},null,null,null,null,86,82,84,89,341,1,"",null,null,10294,{"$f":"IF(T22=\"\",\"\",VLOOKUP(T22,PRIJAVA!$B$35:$H$240,2,FALSE) & \" \" & VLOOKUP(T22,PRIJAVA!$B$35:$H$240,3,FALSE))","v":"PETERNELJ Henrik"},{"$f":"IF(U22=\"\",\"\",VLOOKUP(U22,$C$8:$N$106,5,FALSE))","v":0},{"$f":"IF(U22=\"\",\"\",VLOOKUP(U22,$C$8:$N$106,6,FALSE))","v":0},{"$f":"IF(U22=\"\",\"\",VLOOKUP(U22,$C$8:$N$106,7,FALSE))","v":0},{"$f":"IF(U22=\"\",\"\",VLOOKUP(U22,$C$8:$N$106,8,FALSE))","v":0},{"$f":"IF(U22=\"\",\"\",VLOOKUP(U22,$C$8:$N$106,9,FALSE))","v":85},{"$f":"IF(U22=\"\",\"\",VLOOKUP(U22,$C$8:$L$106,10,FALSE))","v":86},{"$f":"IF(V22=\"\",\"\",VLOOKUP(U22,$C$8:$M$106,11,FALSE))","v":81},{"$f":"IF(U22=\"\",\"\",VLOOKUP(U22,$C$8:$N$106,12,FALSE))","v":75},{"$f":"SUM(V22:AC22)","v":327},{"$f":"IF(U22=\"\",\"\",VLOOKUP(U22,$C$8:$P$106,14,FALSE))","v":0}]
[16,null,{"$f":"IF(E23=\"\",\"\",VLOOKUP(E23,PRIJAVA!$B$35:$H$240,2,FALSE) & \" \" & VLOOKUP(E23,PRIJAVA!$B$35:$H$240,3,FALSE))","v":"BORC Urška"},{"$f":"IF(E23=\"\",\"\",VLOOKUP(E23,PRIJAVA!$B$35:$H$240,5,FALSE))","v":0},13598,{"$f":"IF(E23=\"\",\"\",VLOOKUP(E23,PRIJAVA!$B$35:$H$240,7,FALSE))","v":"SD Trzin"},null,null,null,null,77,85,88,87,337,3,"",null,null,null,null,null,null,null,null,null,null,null,{"$f":"SUM(AC20:AC22)","v":246},{"$f":"SUM(AD20:AD22)","v":1002},{"$f":"SUM(AE20:AE22)","v":6}]
[17,null,{"$f":"IF(E24=\"\",\"\",VLOOKUP(E24,PRIJAVA!$B$35:$H$240,2,FALSE) & \" \" & VLOOKUP(E24,PRIJAVA!$B$35:$H$240,3,FALSE))","v":"ŠTIFTAR Jurij"},{"$f":"IF(E24=\"\",\"\",VLOOKUP(E24,PRIJAVA!$B$35:$H$240,5,FALSE))","v":1969},10365,{"$f":"IF(E24=\"\",\"\",VLOOKUP(E24,PRIJAVA!$B$35:$H$240,7,FALSE))","v":"SD Domžale"},null,null,null,null,86,82,87,81,336,3,""]
[18,null,{"$f":"IF(E25=\"\",\"\",VLOOKUP(E25,PRIJAVA!$B$35:$H$240,2,FALSE) & \" \" & VLOOKUP(E25,PRIJAVA!$B$35:$H$240,3,FALSE))","v":"PETERNELJ Henrik"},{"$f":"IF(E25=\"\",\"\",VLOOKUP(E25,PRIJAVA!$B$35:$H$240,5,FALSE))","v":1941},10294,{"$f":"IF(E25=\"\",\"\",VLOOKUP(E25,PRIJAVA!$B$35:$H$240,7,FALSE))","v":"SD Škofja Loka"},null,null,null,null,85,86,81,75,327,0,""]
[19,null,{"$f":"IF(E26=\"\",\"\",VLOOKUP(E26,PRIJAVA!$B$35:$H$240,2,FALSE) & \" \" & VLOOKUP(E26,PRIJAVA!$B$35:$H$240,3,FALSE))","v":"HABJAN Nuša"},{"$f":"IF(E26=\"\",\"\",VLOOKUP(E26,PRIJAVA!$B$35:$H$240,5,FALSE))","v":2009},16013,{"$f":"IF(E26=\"\",\"\",VLOOKUP(E26,PRIJAVA!$B$35:$H$240,7,FALSE))","v":"SD Lotrič Železniki"},null,null,null,null,83,77,83,82,325,2,"",null,null,null,{"$f":"IF(T28=\"\",\"\",VLOOKUP(T28,PRIJAVA!$B$35:$H$240,7,FALSE))","v":"SD Lotrič Železniki"}]
[20,null,{"$f":"IF(E27=\"\",\"\",VLOOKUP(E27,PRIJAVA!$B$35:$H$240,2,FALSE) & \" \" & VLOOKUP(E27,PRIJAVA!$B$35:$H$240,3,FALSE))","v":"KOŠIR Nik"},{"$f":"IF(E27=\"\",\"\",VLOOKUP(E27,PRIJAVA!$B$35:$H$240,5,FALSE))","v":2005},13430,{"$f":"IF(E27=\"\",\"\",VLOOKUP(E27,PRIJAVA!$B$35:$H$240,7,FALSE))","v":"SD Lotrič Železniki"},null,null,null,null,78,79,77,88,322,2,"",null,null,"BIB","Priimek in ime","1. ser","2. ser","3. ser","4. ser","1. ser","2. ser","3. ser","4. ser","skupno","nc*"]
[21,null,{"$f":"IF(E28=\"\",\"\",VLOOKUP(E28,PRIJAVA!$B$35:$H$240,2,FALSE) & \" \" & VLOOKUP(E28,PRIJAVA!$B$35:$H$240,3,FALSE))","v":"AHAČIČ SREDNIK Nika"},{"$f":"IF(E28=\"\",\"\",VLOOKUP(E28,PRIJAVA!$B$35:$H$240,5,FALSE))","v":1960},14863,{"$f":"IF(E28=\"\",\"\",VLOOKUP(E28,PRIJAVA!$B$35:$H$240,7,FALSE))","v":"SD Lotrič Železniki"},null,null,null,null,79,77,77,88,321,1,"",null,null,14903,{"$f":"IF(T28=\"\",\"\",VLOOKUP(T28,PRIJAVA!$B$35:$H$240,2,FALSE) & \" \" & VLOOKUP(T28,PRIJAVA!$B$35:$H$240,3,FALSE))","v":"TOLAR Žiga"},{"$f":"IF(U28=\"\",\"\",VLOOKUP(U28,$C$8:$N$106,5,FALSE))","v":0},{"$f":"IF(U28=\"\",\"\",VLOOKUP(U28,$C$8:$N$106,6,FALSE))","v":0},{"$f":"IF(U28=\"\",\"\",VLOOKUP(U28,$C$8:$N$106,7,FALSE))","v":0},{"$f":"IF(U28=\"\",\"\",VLOOKUP(U28,$C$8:$N$106,8,FALSE))","v":0},{"$f":"IF(U28=\"\",\"\",VLOOKUP(U28,$C$8:$N$106,9,FALSE))","v":85},{"$f":"IF(U28=\"\",\"\",VLOOKUP(U28,$C$8:$L$106,10,FALSE))","v":86},{"$f":"IF(V28=\"\",\"\",VLOOKUP(U28,$C$8:$M$106,11,FALSE))","v":90},{"$f":"IF(U28=\"\",\"\",VLOOKUP(U28,$C$8:$N$106,12,FALSE))","v":85},{"$f":"SUM(V28:AC28)","v":346},{"$f":"IF(U28=\"\",\"\",VLOOKUP(U28,$C$8:$P$106,14,FALSE))","v":5}]
[22,null,{"$f":"IF(E29=\"\",\"\",VLOOKUP(E29,PRIJAVA!$B$35:$H$240,2,FALSE) & \" \" & VLOOKUP(E29,PRIJAVA!$B$35:$H$240,3,FALSE))","v":"TOLAR Matic"},null,14902,{"$f":"IF(E29=\"\",\"\",VLOOKUP(E29,PRIJAVA!$B$35:$H$240,7,FALSE))","v":"SD Lotrič Železniki"},null,null,null,null,76,80,80,81,317,0,"",null,null,10392,{"$f":"IF(T29=\"\",\"\",VLOOKUP(T29,PRIJAVA!$B$35:$H$240,2,FALSE) & \" \" & VLOOKUP(T29,PRIJAVA!$B$35:$H$240,3,FALSE))","v":"KOŠIR Branko"},{"$f":"IF(U29=\"\",\"\",VLOOKUP(U29,$C$8:$N$106,5,FALSE))","v":0},{"$f":"IF(U29=\"\",\"\",VLOOKUP(U29,$C$8:$N$106,6,FALSE))","v":0},{"$f":"IF(U29=\"\",\"\",VLOOKUP(U29,$C$8:$N$106,7,FALSE))","v":0},{"$f":"IF(U29=\"\",\"\",VLOOKUP(U29,$C$8:$N$106,8,FALSE))","v":0},{"$f":"IF(U29=\"\",\"\",VLOOKUP(U29,$C$8:$N$106,9,FALSE))","v":92},{"$f":"IF(U29=\"\",\"\",VLOOKUP(U29,$C$8:$L$106,10,FALSE))","v":88},{"$f":"IF(V29=\"\",\"\",VLOOKUP(U29,$C$8:$M$106,11,FALSE))","v":89},{"$f":"IF(U29=\"\",\"\",VLOOKUP(U29,$C$8:$N$106,12,FALSE))","v":87},{"$f":"SUM(V29:AC29)","v":356},{"$f":"IF(U29=\"\",\"\",VLOOKUP(U29,$C$8:$P$106,14,FALSE))","v":5}]
[23,null,{"$f":"IF(E30=\"\",\"\",VLOOKUP(E30,PRIJAVA!$B$35:$H$240,2,FALSE) & \" \" & VLOOKUP(E30,PRIJAVA!$B$35:$H$240,3,FALSE))","v":"HAFNAR Matjaž"},{"$f":"IF(E30=\"\",\"\",VLOOKUP(E30,PRIJAVA!$B$35:$H$240,5,FALSE))","v":1973},15198,{"$f":"IF(E30=\"\",\"\",VLOOKUP(E30,PRIJAVA!$B$35:$H$240,7,FALSE))","v":"SD Škofja Loka"},null,null,null,null,81,74,84,76,315,1,"",null,null,11107,{"$f":"IF(T30=\"\",\"\",VLOOKUP(T30,PRIJAVA!$B$35:$H$240,2,FALSE) & \" \" & VLOOKUP(T30,PRIJAVA!$B$35:$H$240,3,FALSE))","v":"PRELEC Tomaž"},{"$f":"IF(U30=\"\",\"\",VLOOKUP(U30,$C$8:$N$106,5,FALSE))","v":0},{"$f":"IF(U30=\"\",\"\",VLOOKUP(U30,$C$8:$N$106,6,FALSE))","v":0},{"$f":"IF(U30=\"\",\"\",VLOOKUP(U30,$C$8:$N$106,7,FALSE))","v":0},{"$f":"IF(U30=\"\",\"\",VLOOKUP(U30,$C$8:$N$106,8,FALSE))","v":0},{"$f":"IF(U30=\"\",\"\",VLOOKUP(U30,$C$8:$N$106,9,FALSE))","v":81},{"$f":"IF(U30=\"\",\"\",VLOOKUP(U30,$C$8:$L$106,10,FALSE))","v":88},{"$f":"IF(V30=\"\",\"\",VLOOKUP(U30,$C$8:$M$106,11,FALSE))","v":83},{"$f":"IF(U30=\"\",\"\",VLOOKUP(U30,$C$8:$N$106,12,FALSE))","v":92},{"$f":"SUM(V30:AC30)","v":344},{"$f":"IF(U30=\"\",\"\",VLOOKUP(U30,$C$8:$P$106,14,FALSE))","v":5}]
[24,null,{"$f":"IF(E31=\"\",\"\",VLOOKUP(E31,PRIJAVA!$B$35:$H$240,2,FALSE) & \" \" & VLOOKUP(E31,PRIJAVA!$B$35:$H$240,3,FALSE))","v":"ČAUŠEVIČ Alen"},{"$f":"IF(E31=\"\",\"\",VLOOKUP(E31,PRIJAVA!$B$35:$H$240,5,FALSE))","v":1992},11526,{"$f":"IF(E31=\"\",\"\",VLOOKUP(E31,PRIJAVA!$B$35:$H$240,7,FALSE))","v":"SD Domžale"},null,null,null,null,72,82,83,77,314,4,"",null,null,null,null,null,null,null,null,null,null,null,{"$f":"SUM(AC28:AC30)","v":264},{"$f":"SUM(AD28:AD30)","v":1046},{"$f":"SUM(AE28:AE30)","v":15}]
[25,null,{"$f":"IF(E32=\"\",\"\",VLOOKUP(E32,PRIJAVA!$B$35:$H$240,2,FALSE) & \" \" & VLOOKUP(E32,PRIJAVA!$B$35:$H$240,3,FALSE))","v":"ČEMAŽAR Niko"},{"$f":"IF(E32=\"\",\"\",VLOOKUP(E32,PRIJAVA!$B$35:$H$240,5,FALSE))","v":1979},16378,{"$f":"IF(E32=\"\",\"\",VLOOKUP(E32,PRIJAVA!$B$35:$H$240,7,FALSE))","v":"SD Lotrič Železniki"},null,null,null,null,80,74,80,74,308,3,""]
[26,null,{"$f":"IF(E33=\"\",\"\",VLOOKUP(E33,PRIJAVA!$B$35:$H$240,2,FALSE) & \" \" & VLOOKUP(E33,PRIJAVA!$B$35:$H$240,3,FALSE))","v":"MATAN Nuša"},null,10694,{"$f":"IF(E33=\"\",\"\",VLOOKUP(E33,PRIJAVA!$B$35:$H$240,7,FALSE))","v":"SD Trzin"},null,null,null,null,null,null,null,null,0,"DNS",""]
[27,null,{"$f":"IF(E34=\"\",\"\",VLOOKUP(E34,PRIJAVA!$B$35:$H$240,2,FALSE) & \" \" & VLOOKUP(E34,PRIJAVA!$B$35:$H$240,3,FALSE))","v":"DOBRAVEC Petra"},{"$f":"IF(E34=\"\",\"\",VLOOKUP(E34,PRIJAVA!$B$35:$H$240,5,FALSE))","v":1970},11172,{"$f":"IF(E34=\"\",\"\",VLOOKUP(E34,PRIJAVA!$B$35:$H$240,7,FALSE))","v":"SD Lotrič Železniki"},null,null,null,null,null,null,null,null,0,"DNS","",null,null,null,{"$f":"IF(T36=\"\",\"\",VLOOKUP(T36,PRIJAVA!$B$35:$H$240,7,FALSE))","v":"SD Domžale"}]
[28,null,{"$f":"IF(E35=\"\",\"\",VLOOKUP(E35,PRIJAVA!$B$35:$H$240,2,FALSE) & \" \" & VLOOKUP(E35,PRIJAVA!$B$35:$H$240,3,FALSE))","v":"PREZELJ Matej"},null,14549,{"$f":"IF(E35=\"\",\"\",VLOOKUP(E35,PRIJAVA!$B$35:$H$240,7,FALSE))","v":"SD Lotrič Železniki"},null,null,null,null,null,null,null,null,{"$f":"SUM(K35:N35)","v":0},"DNS","",null,null,"BIB","Priimek in ime","1. ser","2. ser","3. ser","4. ser","1. ser","2. ser","3. ser","4. ser","skupno","nc*"]
[29,null,{"$f":"IF(E36=\"\",\"\",VLOOKUP(E36,PRIJAVA!$B$35:$H$240,2,FALSE) & \" \" & VLOOKUP(E36,PRIJAVA!$B$35:$H$240,3,FALSE))","v":""},{"$f":"IF(E36=\"\",\"\",VLOOKUP(E36,PRIJAVA!$B$35:$H$240,5,FALSE))","v":""},null,{"$f":"IF(E36=\"\",\"\",VLOOKUP(E36,PRIJAVA!$B$35:$H$240,7,FALSE))","v":""},null,null,null,null,null,null,null,null,{"$f":"SUM(G36:N36)","v":0},null,"",null,null,10365,{"$f":"IF(T36=\"\",\"\",VLOOKUP(T36,PRIJAVA!$B$35:$H$240,2,FALSE) & \" \" & VLOOKUP(T36,PRIJAVA!$B$35:$H$240,3,FALSE))","v":"ŠTIFTAR Jurij"},{"$f":"IF(U36=\"\",\"\",VLOOKUP(U36,$C$8:$N$106,5,FALSE))","v":0},{"$f":"IF(U36=\"\",\"\",VLOOKUP(U36,$C$8:$N$106,6,FALSE))","v":0},{"$f":"IF(U36=\"\",\"\",VLOOKUP(U36,$C$8:$N$106,7,FALSE))","v":0},{"$f":"IF(U36=\"\",\"\",VLOOKUP(U36,$C$8:$N$106,8,FALSE))","v":0},{"$f":"IF(U36=\"\",\"\",VLOOKUP(U36,$C$8:$N$106,9,FALSE))","v":86},{"$f":"IF(U36=\"\",\"\",VLOOKUP(U36,$C$8:$L$106,10,FALSE))","v":82},{"$f":"IF(V36=\"\",\"\",VLOOKUP(U36,$C$8:$M$106,11,FALSE))","v":87},{"$f":"IF(U36=\"\",\"\",VLOOKUP(U36,$C$8:$N$106,12,FALSE))","v":81},{"$f":"SUM(V36:AC36)","v":336},{"$f":"IF(U36=\"\",\"\",VLOOKUP(U36,$C$8:$P$106,14,FALSE))","v":3}]
[30,null,{"$f":"IF(E37=\"\",\"\",VLOOKUP(E37,PRIJAVA!$B$35:$H$240,2,FALSE) & \" \" & VLOOKUP(E37,PRIJAVA!$B$35:$H$240,3,FALSE))","v":""},{"$f":"IF(E37=\"\",\"\",VLOOKUP(E37,PRIJAVA!$B$35:$H$240,5,FALSE))","v":""},null,{"$f":"IF(E37=\"\",\"\",VLOOKUP(E37,PRIJAVA!$B$35:$H$240,7,FALSE))","v":""},null,null,null,null,null,null,null,null,0,null,"",null,null,10177,{"$f":"IF(T37=\"\",\"\",VLOOKUP(T37,PRIJAVA!$B$35:$H$240,2,FALSE) & \" \" & VLOOKUP(T37,PRIJAVA!$B$35:$H$240,3,FALSE))","v":"DIMIC Klemen"},{"$f":"IF(U37=\"\",\"\",VLOOKUP(U37,$C$8:$N$106,5,FALSE))","v":0},{"$f":"IF(U37=\"\",\"\",VLOOKUP(U37,$C$8:$N$106,6,FALSE))","v":0},{"$f":"IF(U37=\"\",\"\",VLOOKUP(U37,$C$8:$N$106,7,FALSE))","v":0},{"$f":"IF(U37=\"\",\"\",VLOOKUP(U37,$C$8:$N$106,8,FALSE))","v":0},{"$f":"IF(U37=\"\",\"\",VLOOKUP(U37,$C$8:$N$106,9,FALSE))","v":86},{"$f":"IF(U37=\"\",\"\",VLOOKUP(U37,$C$8:$L$106,10,FALSE))","v":82},{"$f":"IF(V37=\"\",\"\",VLOOKUP(U37,$C$8:$M$106,11,FALSE))","v":84},{"$f":"IF(U37=\"\",\"\",VLOOKUP(U37,$C$8:$N$106,12,FALSE))","v":89},{"$f":"SUM(V37:AC37)","v":341},{"$f":"IF(U37=\"\",\"\",VLOOKUP(U37,$C$8:$P$106,14,FALSE))","v":1}]
[31,null,{"$f":"IF(E38=\"\",\"\",VLOOKUP(E38,PRIJAVA!$B$35:$H$240,2,FALSE) & \" \" & VLOOKUP(E38,PRIJAVA!$B$35:$H$240,3,FALSE))","v":""},{"$f":"IF(E38=\"\",\"\",VLOOKUP(E38,PRIJAVA!$B$35:$H$240,5,FALSE))","v":""},null,{"$f":"IF(E38=\"\",\"\",VLOOKUP(E38,PRIJAVA!$B$35:$H$240,7,FALSE))","v":""},null,null,null,null,null,null,null,null,0,null,"",null,null,11526,{"$f":"IF(T38=\"\",\"\",VLOOKUP(T38,PRIJAVA!$B$35:$H$240,2,FALSE) & \" \" & VLOOKUP(T38,PRIJAVA!$B$35:$H$240,3,FALSE))","v":"ČAUŠEVIČ Alen"},{"$f":"IF(U38=\"\",\"\",VLOOKUP(U38,$C$8:$N$106,5,FALSE))","v":0},{"$f":"IF(U38=\"\",\"\",VLOOKUP(U38,$C$8:$N$106,6,FALSE))","v":0},{"$f":"IF(U38=\"\",\"\",VLOOKUP(U38,$C$8:$N$106,7,FALSE))","v":0},{"$f":"IF(U38=\"\",\"\",VLOOKUP(U38,$C$8:$N$106,8,FALSE))","v":0},{"$f":"IF(U38=\"\",\"\",VLOOKUP(U38,$C$8:$N$106,9,FALSE))","v":72},{"$f":"IF(U38=\"\",\"\",VLOOKUP(U38,$C$8:$L$106,10,FALSE))","v":82},{"$f":"IF(V38=\"\",\"\",VLOOKUP(U38,$C$8:$M$106,11,FALSE))","v":83},{"$f":"IF(U38=\"\",\"\",VLOOKUP(U38,$C$8:$N$106,12,FALSE))","v":77},{"$f":"SUM(V38:AC38)","v":314},{"$f":"IF(U38=\"\",\"\",VLOOKUP(U38,$C$8:$P$106,14,FALSE))","v":4}]
[32,null,{"$f":"IF(E39=\"\",\"\",VLOOKUP(E39,PRIJAVA!$B$35:$H$240,2,FALSE) & \" \" & VLOOKUP(E39,PRIJAVA!$B$35:$H$240,3,FALSE))","v":""},{"$f":"IF(E39=\"\",\"\",VLOOKUP(E39,PRIJAVA!$B$35:$H$240,5,FALSE))","v":""},null,{"$f":"IF(E39=\"\",\"\",VLOOKUP(E39,PRIJAVA!$B$35:$H$240,7,FALSE))","v":""},null,null,null,null,null,null,null,null,0,null,"",null,null,null,null,null,null,null,null,null,null,null,{"$f":"SUM(AC36:AC38)","v":247},{"$f":"SUM(AD36:AD38)","v":991},{"$f":"SUM(AE36:AE38)","v":8}]
[33,null,{"$f":"IF(E40=\"\",\"\",VLOOKUP(E40,PRIJAVA!$B$35:$H$240,2,FALSE) & \" \" & VLOOKUP(E40,PRIJAVA!$B$35:$H$240,3,FALSE))","v":""},{"$f":"IF(E40=\"\",\"\",VLOOKUP(E40,PRIJAVA!$B$35:$H$240,5,FALSE))","v":""},null,{"$f":"IF(E40=\"\",\"\",VLOOKUP(E40,PRIJAVA!$B$35:$H$240,7,FALSE))","v":""},null,null,null,null,null,null,null,null,0,null,""]
[34,null,{"$f":"IF(E41=\"\",\"\",VLOOKUP(E41,PRIJAVA!$B$35:$H$240,2,FALSE) & \" \" & VLOOKUP(E41,PRIJAVA!$B$35:$H$240,3,FALSE))","v":""},{"$f":"IF(E41=\"\",\"\",VLOOKUP(E41,PRIJAVA!$B$35:$H$240,5,FALSE))","v":""},null,{"$f":"IF(E41=\"\",\"\",VLOOKUP(E41,PRIJAVA!$B$35:$H$240,7,FALSE))","v":""},null,null,null,null,null,null,null,null,0,null,""]
[35,null,{"$f":"IF(E42=\"\",\"\",VLOOKUP(E42,PRIJAVA!$B$35:$H$240,2,FALSE) & \" \" & VLOOKUP(E42,PRIJAVA!$B$35:$H$240,3,FALSE))","v":""},{"$f":"IF(E42=\"\",\"\",VLOOKUP(E42,PRIJAVA!$B$35:$H$240,5,FALSE))","v":""},null,{"$f":"IF(E42=\"\",\"\",VLOOKUP(E42,PRIJAVA!$B$35:$H$240,7,FALSE))","v":""},null,null,null,null,null,null,null,null,0,null,"",null,null,null,{"$f":"IF(T44=\"\",\"\",VLOOKUP(T44,PRIJAVA!$B$35:$H$240,7,FALSE))","v":"SD Gorenja vas"}]
[36,null,null,null,null,null,null,null,null,null,null,null,null,null,0,null,null,null,null,"BIB","Priimek in ime","1. ser","2. ser","3. ser","4. ser","1. ser","2. ser","3. ser","4. ser","skupno","nc*"]
[37,null,null,null,null,null,null,null,null,null,null,null,null,null,{"$f":"SUM(G44:N44)","v":0},null,"",null,null,10536,{"$f":"IF(T44=\"\",\"\",VLOOKUP(T44,PRIJAVA!$B$35:$H$240,2,FALSE) & \" \" & VLOOKUP(T44,PRIJAVA!$B$35:$H$240,3,FALSE))","v":"CANKAR David"},{"$f":"IF(U44=\"\",\"\",VLOOKUP(U44,$C$8:$N$106,5,FALSE))","v":0},{"$f":"IF(U44=\"\",\"\",VLOOKUP(U44,$C$8:$N$106,6,FALSE))","v":0},{"$f":"IF(U44=\"\",\"\",VLOOKUP(U44,$C$8:$N$106,7,FALSE))","v":0},{"$f":"IF(U44=\"\",\"\",VLOOKUP(U44,$C$8:$N$106,8,FALSE))","v":0},{"$f":"IF(U44=\"\",\"\",VLOOKUP(U44,$C$8:$N$106,9,FALSE))","v":83},{"$f":"IF(U44=\"\",\"\",VLOOKUP(U44,$C$8:$L$106,10,FALSE))","v":95},{"$f":"IF(V44=\"\",\"\",VLOOKUP(U44,$C$8:$M$106,11,FALSE))","v":95},{"$f":"IF(U44=\"\",\"\",VLOOKUP(U44,$C$8:$N$106,12,FALSE))","v":88},{"$f":"SUM(V44:AC44)","v":361},{"$f":"IF(U44=\"\",\"\",VLOOKUP(U44,$C$8:$P$106,14,FALSE))","v":6}]
[38,null,{"$f":"IF(E45=\"\",\"\",VLOOKUP(E45,PRIJAVA!$B$35:$H$240,2,FALSE) & \" \" & VLOOKUP(E45,PRIJAVA!$B$35:$H$240,3,FALSE))","v":""},{"$f":"IF(E45=\"\",\"\",VLOOKUP(E45,PRIJAVA!$B$35:$H$240,5,FALSE))","v":""},null,{"$f":"IF(E45=\"\",\"\",VLOOKUP(E45,PRIJAVA!$B$35:$H$240,7,FALSE))","v":""},null,null,null,null,null,null,null,null,{"$f":"SUM(G45:N45)","v":0},null,"",null,null,15608,{"$f":"IF(T45=\"\",\"\",VLOOKUP(T45,PRIJAVA!$B$35:$H$240,2,FALSE) & \" \" & VLOOKUP(T45,PRIJAVA!$B$35:$H$240,3,FALSE))","v":"HUJIĆ Meldin"},{"$f":"IF(U45=\"\",\"\",VLOOKUP(U45,$C$8:$N$106,5,FALSE))","v":0},{"$f":"IF(U45=\"\",\"\",VLOOKUP(U45,$C$8:$N$106,6,FALSE))","v":0},{"$f":"IF(U45=\"\",\"\",VLOOKUP(U45,$C$8:$N$106,7,FALSE))","v":0},{"$f":"IF(U45=\"\",\"\",VLOOKUP(U45,$C$8:$N$106,8,FALSE))","v":0},{"$f":"IF(U45=\"\",\"\",VLOOKUP(U45,$C$8:$N$106,9,FALSE))","v":87},{"$f":"IF(U45=\"\",\"\",VLOOKUP(U45,$C$8:$L$106,10,FALSE))","v":94},{"$f":"IF(V45=\"\",\"\",VLOOKUP(U45,$C$8:$M$106,11,FALSE))","v":92},{"$f":"IF(U45=\"\",\"\",VLOOKUP(U45,$C$8:$N$106,12,FALSE))","v":93},{"$f":"SUM(V45:AC45)","v":366},{"$f":"IF(U45=\"\",\"\",VLOOKUP(U45,$C$8:$P$106,14,FALSE))","v":8}]
[39,null,{"$f":"IF(E46=\"\",\"\",VLOOKUP(E46,PRIJAVA!$B$35:$H$240,2,FALSE) & \" \" & VLOOKUP(E46,PRIJAVA!$B$35:$H$240,3,FALSE))","v":""},{"$f":"IF(E46=\"\",\"\",VLOOKUP(E46,PRIJAVA!$B$35:$H$240,5,FALSE))","v":""},null,{"$f":"IF(E46=\"\",\"\",VLOOKUP(E46,PRIJAVA!$B$35:$H$240,7,FALSE))","v":""},null,null,null,null,null,null,null,null,0,null,"",null,null,16320,{"$f":"IF(T46=\"\",\"\",VLOOKUP(T46,PRIJAVA!$B$35:$H$240,2,FALSE) & \" \" & VLOOKUP(T46,PRIJAVA!$B$35:$H$240,3,FALSE))","v":"KUNC Tilen"},{"$f":"IF(U46=\"\",\"\",VLOOKUP(U46,$C$8:$N$106,5,FALSE))","v":0},{"$f":"IF(U46=\"\",\"\",VLOOKUP(U46,$C$8:$N$106,6,FALSE))","v":0},{"$f":"IF(U46=\"\",\"\",VLOOKUP(U46,$C$8:$N$106,7,FALSE))","v":0},{"$f":"IF(U46=\"\",\"\",VLOOKUP(U46,$C$8:$N$106,8,FALSE))","v":0},{"$f":"IF(U46=\"\",\"\",VLOOKUP(U46,$C$8:$N$106,9,FALSE))","v":88},{"$f":"IF(U46=\"\",\"\",VLOOKUP(U46,$C$8:$L$106,10,FALSE))","v":84},{"$f":"IF(V46=\"\",\"\",VLOOKUP(U46,$C$8:$M$106,11,FALSE))","v":90},{"$f":"IF(U46=\"\",\"\",VLOOKUP(U46,$C$8:$N$106,12,FALSE))","v":90},{"$f":"SUM(V46:AC46)","v":352},{"$f":"IF(U46=\"\",\"\",VLOOKUP(U46,$C$8:$P$106,14,FALSE))","v":7}]
[40,null,{"$f":"IF(E47=\"\",\"\",VLOOKUP(E47,PRIJAVA!$B$35:$H$240,2,FALSE) & \" \" & VLOOKUP(E47,PRIJAVA!$B$35:$H$240,3,FALSE))","v":""},{"$f":"IF(E47=\"\",\"\",VLOOKUP(E47,PRIJAVA!$B$35:$H$240,5,FALSE))","v":""},null,{"$f":"IF(E47=\"\",\"\",VLOOKUP(E47,PRIJAVA!$B$35:$H$240,7,FALSE))","v":""},null,null,null,null,null,null,null,null,0,null,"",null,null,null,null,null,null,null,null,null,null,null,{"$f":"SUM(AC44:AC46)","v":271},{"$f":"SUM(AD44:AD46)","v":1079},{"$f":"SUM(AE44:AE46)","v":21}]
[41,null,{"$f":"IF(E48=\"\",\"\",VLOOKUP(E48,PRIJAVA!$B$35:$H$240,2,FALSE) & \" \" & VLOOKUP(E48,PRIJAVA!$B$35:$H$240,3,FALSE))","v":""},{"$f":"IF(E48=\"\",\"\",VLOOKUP(E48,PRIJAVA!$B$35:$H$240,5,FALSE))","v":""},null,{"$f":"IF(E48=\"\",\"\",VLOOKUP(E48,PRIJAVA!$B$35:$H$240,7,FALSE))","v":""},null,null,null,null,null,null,null,null,{"$f":"SUM(G48:N48)","v":0}]
[42,null,{"$f":"IF(E49=\"\",\"\",VLOOKUP(E49,PRIJAVA!$B$35:$H$240,2,FALSE) & \" \" & VLOOKUP(E49,PRIJAVA!$B$35:$H$240,3,FALSE))","v":""},{"$f":"IF(E49=\"\",\"\",VLOOKUP(E49,PRIJAVA!$B$35:$H$240,5,FALSE))","v":""},null,{"$f":"IF(E49=\"\",\"\",VLOOKUP(E49,PRIJAVA!$B$35:$H$240,7,FALSE))","v":""},null,null,null,null,null,null,null,null,0]
[43,null,{"$f":"IF(E50=\"\",\"\",VLOOKUP(E50,PRIJAVA!$B$35:$H$240,2,FALSE) & \" \" & VLOOKUP(E50,PRIJAVA!$B$35:$H$240,3,FALSE))","v":""},{"$f":"IF(E50=\"\",\"\",VLOOKUP(E50,PRIJAVA!$B$35:$H$240,5,FALSE))","v":""},null,{"$f":"IF(E50=\"\",\"\",VLOOKUP(E50,PRIJAVA!$B$35:$H$240,7,FALSE))","v":""},null,null,null,null,null,null,null,null,0]
[44,null,{"$f":"IF(E51=\"\",\"\",VLOOKUP(E51,PRIJAVA!$B$35:$H$240,2,FALSE) & \" \" & VLOOKUP(E51,PRIJAVA!$B$35:$H$240,3,FALSE))","v":""},{"$f":"IF(E51=\"\",\"\",VLOOKUP(E51,PRIJAVA!$B$35:$H$240,5,FALSE))","v":""},null,{"$f":"IF(E51=\"\",\"\",VLOOKUP(E51,PRIJAVA!$B$35:$H$240,7,FALSE))","v":""},null,null,null,null,null,null,null,null,0]
[45,null,{"$f":"IF(E52=\"\",\"\",VLOOKUP(E52,PRIJAVA!$B$35:$H$240,2,FALSE) & \" \" & VLOOKUP(E52,PRIJAVA!$B$35:$H$240,3,FALSE))","v":""},{"$f":"IF(E52=\"\",\"\",VLOOKUP(E52,PRIJAVA!$B$35:$H$240,5,FALSE))","v":""},null,{"$f":"IF(E52=\"\",\"\",VLOOKUP(E52,PRIJAVA!$B$35:$H$240,7,FALSE))","v":""},null,null,null,null,null,null,null,null,0]
[46,null,{"$f":"IF(E53=\"\",\"\",VLOOKUP(E53,PRIJAVA!$B$35:$H$240,2,FALSE) & \" \" & VLOOKUP(E53,PRIJAVA!$B$35:$H$240,3,FALSE))","v":""},{"$f":"IF(E53=\"\",\"\",VLOOKUP(E53,PRIJAVA!$B$35:$H$240,5,FALSE))","v":""},null,{"$f":"IF(E53=\"\",\"\",VLOOKUP(E53,PRIJAVA!$B$35:$H$240,7,FALSE))","v":""},null,null,null,null,null,null,null,null,0]
[47,null,{"$f":"IF(E54=\"\",\"\",VLOOKUP(E54,PRIJAVA!$B$35:$H$240,2,FALSE) & \" \" & VLOOKUP(E54,PRIJAVA!$B$35:$H$240,3,FALSE))","v":""},{"$f":"IF(E54=\"\",\"\",VLOOKUP(E54,PRIJAVA!$B$35:$H$240,5,FALSE))","v":""},null,{"$f":"IF(E54=\"\",\"\",VLOOKUP(E54,PRIJAVA!$B$35:$H$240,7,FALSE))","v":""},null,null,null,null,null,null,null,null,0]
[48,null,{"$f":"IF(E55=\"\",\"\",VLOOKUP(E55,PRIJAVA!$B$35:$H$240,2,FALSE) & \" \" & VLOOKUP(E55,PRIJAVA!$B$35:$H$240,3,FALSE))","v":""},{"$f":"IF(E55=\"\",\"\",VLOOKUP(E55,PRIJAVA!$B$35:$H$240,5,FALSE))","v":""},null,{"$f":"IF(E55=\"\",\"\",VLOOKUP(E55,PRIJAVA!$B$35:$H$240,7,FALSE))","v":""},null,null,null,null,null,null,null,null,0]
[49,null,{"$f":"IF(E56=\"\",\"\",VLOOKUP(E56,PRIJAVA!$B$35:$H$240,2,FALSE) & \" \" & VLOOKUP(E56,PRIJAVA!$B$35:$H$240,3,FALSE))","v":""},{"$f":"IF(E56=\"\",\"\",VLOOKUP(E56,PRIJAVA!$B$35:$H$240,5,FALSE))","v":""},null,{"$f":"IF(E56=\"\",\"\",VLOOKUP(E56,PRIJAVA!$B$35:$H$240,7,FALSE))","v":""},null,null,null,null,null,null,null,null,0]
[50,null,{"$f":"IF(E57=\"\",\"\",VLOOKUP(E57,PRIJAVA!$B$35:$H$240,2,FALSE) & \" \" & VLOOKUP(E57,PRIJAVA!$B$35:$H$240,3,FALSE))","v":""},{"$f":"IF(E57=\"\",\"\",VLOOKUP(E57,PRIJAVA!$B$35:$H$240,5,FALSE))","v":""},null,{"$f":"IF(E57=\"\",\"\",VLOOKUP(E57,PRIJAVA!$B$35:$H$240,7,FALSE))","v":""},null,null,null,null,null,null,null,null,0]
[51,null,{"$f":"IF(E58=\"\",\"\",VLOOKUP(E58,PRIJAVA!$B$35:$H$240,2,FALSE) & \" \" & VLOOKUP(E58,PRIJAVA!$B$35:$H$240,3,FALSE))","v":""},{"$f":"IF(E58=\"\",\"\",VLOOKUP(E58,PRIJAVA!$B$35:$H$240,5,FALSE))","v":""},null,{"$f":"IF(E58=\"\",\"\",VLOOKUP(E58,PRIJAVA!$B$35:$H$240,7,FALSE))","v":""},null,null,null,null,null,null,null,null,0]
[52,null,{"$f":"IF(E59=\"\",\"\",VLOOKUP(E59,PRIJAVA!$B$35:$H$240,2,FALSE) & \" \" & VLOOKUP(E59,PRIJAVA!$B$35:$H$240,3,FALSE))","v":""},{"$f":"IF(E59=\"\",\"\",VLOOKUP(E59,PRIJAVA!$B$35:$H$240,5,FALSE))","v":""},null,{"$f":"IF(E59=\"\",\"\",VLOOKUP(E59,PRIJAVA!$B$35:$H$240,7,FALSE))","v":""},null,null,null,null,null,null,null,null,0]
[53,null,{"$f":"IF(E60=\"\",\"\",VLOOKUP(E60,PRIJAVA!$B$35:$H$240,2,FALSE) & \" \" & VLOOKUP(E60,PRIJAVA!$B$35:$H$240,3,FALSE))","v":""},{"$f":"IF(E60=\"\",\"\",VLOOKUP(E60,PRIJAVA!$B$35:$H$240,5,FALSE))","v":""},null,{"$f":"IF(E60=\"\",\"\",VLOOKUP(E60,PRIJAVA!$B$35:$H$240,7,FALSE))","v":""},null,null,null,null,null,null,null,null,0]
[54,null,{"$f":"IF(E61=\"\",\"\",VLOOKUP(E61,PRIJAVA!$B$35:$H$240,2,FALSE) & \" \" & VLOOKUP(E61,PRIJAVA!$B$35:$H$240,3,FALSE))","v":""},{"$f":"IF(E61=\"\",\"\",VLOOKUP(E61,PRIJAVA!$B$35:$H$240,5,FALSE))","v":""},null,{"$f":"IF(E61=\"\",\"\",VLOOKUP(E61,PRIJAVA!$B$35:$H$240,7,FALSE))","v":""},null,null,null,null,null,null,null,null,0]
[55,null,{"$f":"IF(E62=\"\",\"\",VLOOKUP(E62,PRIJAVA!$B$35:$H$240,2,FALSE) & \" \" & VLOOKUP(E62,PRIJAVA!$B$35:$H$240,3,FALSE))","v":""},{"$f":"IF(E62=\"\",\"\",VLOOKUP(E62,PRIJAVA!$B$35:$H$240,5,FALSE))","v":""},null,{"$f":"IF(E62=\"\",\"\",VLOOKUP(E62,PRIJAVA!$B$35:$H$240,7,FALSE))","v":""},null,null,null,null,null,null,null,null,0]
[56,null,{"$f":"IF(E63=\"\",\"\",VLOOKUP(E63,PRIJAVA!$B$35:$H$240,2,FALSE) & \" \" & VLOOKUP(E63,PRIJAVA!$B$35:$H$240,3,FALSE))","v":""},{"$f":"IF(E63=\"\",\"\",VLOOKUP(E63,PRIJAVA!$B$35:$H$240,5,FALSE))","v":""},null,{"$f":"IF(E63=\"\",\"\",VLOOKUP(E63,PRIJAVA!$B$35:$H$240,7,FALSE))","v":""},null,null,null,null,null,null,null,null,0]
[57,null,{"$f":"IF(E64=\"\",\"\",VLOOKUP(E64,PRIJAVA!$B$35:$H$240,2,FALSE) & \" \" & VLOOKUP(E64,PRIJAVA!$B$35:$H$240,3,FALSE))","v":""},{"$f":"IF(E64=\"\",\"\",VLOOKUP(E64,PRIJAVA!$B$35:$H$240,5,FALSE))","v":""},null,{"$f":"IF(E64=\"\",\"\",VLOOKUP(E64,PRIJAVA!$B$35:$H$240,7,FALSE))","v":""},null,null,null,null,null,null,null,null,0]
[58,null,{"$f":"IF(E65=\"\",\"\",VLOOKUP(E65,PRIJAVA!$B$35:$H$240,2,FALSE) & \" \" & VLOOKUP(E65,PRIJAVA!$B$35:$H$240,3,FALSE))","v":""},{"$f":"IF(E65=\"\",\"\",VLOOKUP(E65,PRIJAVA!$B$35:$H$240,5,FALSE))","v":""},null,{"$f":"IF(E65=\"\",\"\",VLOOKUP(E65,PRIJAVA!$B$35:$H$240,7,FALSE))","v":""},null,null,null,null,null,null,null,null,0]
[59,null,{"$f":"IF(E66=\"\",\"\",VLOOKUP(E66,PRIJAVA!$B$35:$H$240,2,FALSE) & \" \" & VLOOKUP(E66,PRIJAVA!$B$35:$H$240,3,FALSE))","v":""},{"$f":"IF(E66=\"\",\"\",VLOOKUP(E66,PRIJAVA!$B$35:$H$240,5,FALSE))","v":""},null,{"$f":"IF(E66=\"\",\"\",VLOOKUP(E66,PRIJAVA!$B$35:$H$240,7,FALSE))","v":""},null,null,null,null,null,null,null,null,0]
[60,null,{"$f":"IF(E67=\"\",\"\",VLOOKUP(E67,PRIJAVA!$B$35:$H$240,2,FALSE) & \" \" & VLOOKUP(E67,PRIJAVA!$B$35:$H$240,3,FALSE))","v":""},{"$f":"IF(E67=\"\",\"\",VLOOKUP(E67,PRIJAVA!$B$35:$H$240,5,FALSE))","v":""},null,{"$f":"IF(E67=\"\",\"\",VLOOKUP(E67,PRIJAVA!$B$35:$H$240,7,FALSE))","v":""},null,null,null,null,null,null,null,null,0]
[61,null,{"$f":"IF(E68=\"\",\"\",VLOOKUP(E68,PRIJAVA!$B$35:$H$240,2,FALSE) & \" \" & VLOOKUP(E68,PRIJAVA!$B$35:$H$240,3,FALSE))","v":""},{"$f":"IF(E68=\"\",\"\",VLOOKUP(E68,PRIJAVA!$B$35:$H$240,5,FALSE))","v":""},null,{"$f":"IF(E68=\"\",\"\",VLOOKUP(E68,PRIJAVA!$B$35:$H$240,7,FALSE))","v":""},null,null,null,null,null,null,null,null,0]
[62,null,{"$f":"IF(E69=\"\",\"\",VLOOKUP(E69,PRIJAVA!$B$35:$H$240,2,FALSE) & \" \" & VLOOKUP(E69,PRIJAVA!$B$35:$H$240,3,FALSE))","v":""},{"$f":"IF(E69=\"\",\"\",VLOOKUP(E69,PRIJAVA!$B$35:$H$240,5,FALSE))","v":""},null,{"$f":"IF(E69=\"\",\"\",VLOOKUP(E69,PRIJAVA!$B$35:$H$240,7,FALSE))","v":""},null,null,null,null,null,null,null,null,0]
[63,null,{"$f":"IF(E70=\"\",\"\",VLOOKUP(E70,PRIJAVA!$B$35:$H$240,2,FALSE) & \" \" & VLOOKUP(E70,PRIJAVA!$B$35:$H$240,3,FALSE))","v":""},{"$f":"IF(E70=\"\",\"\",VLOOKUP(E70,PRIJAVA!$B$35:$H$240,5,FALSE))","v":""},null,{"$f":"IF(E70=\"\",\"\",VLOOKUP(E70,PRIJAVA!$B$35:$H$240,7,FALSE))","v":""},null,null,null,null,null,null,null,null,0]
[64,null,{"$f":"IF(E71=\"\",\"\",VLOOKUP(E71,PRIJAVA!$B$35:$H$240,2,FALSE) & \" \" & VLOOKUP(E71,PRIJAVA!$B$35:$H$240,3,FALSE))","v":""},{"$f":"IF(E71=\"\",\"\",VLOOKUP(E71,PRIJAVA!$B$35:$H$240,5,FALSE))","v":""},null,{"$f":"IF(E71=\"\",\"\",VLOOKUP(E71,PRIJAVA!$B$35:$H$240,7,FALSE))","v":""},null,null,null,null,null,null,null,null,0]
[65,null,{"$f":"IF(E72=\"\",\"\",VLOOKUP(E72,PRIJAVA!$B$35:$H$240,2,FALSE) & \" \" & VLOOKUP(E72,PRIJAVA!$B$35:$H$240,3,FALSE))","v":""},{"$f":"IF(E72=\"\",\"\",VLOOKUP(E72,PRIJAVA!$B$35:$H$240,5,FALSE))","v":""},null,{"$f":"IF(E72=\"\",\"\",VLOOKUP(E72,PRIJAVA!$B$35:$H$240,7,FALSE))","v":""},null,null,null,null,null,null,null,null,{"$f":"SUM(G72:N72)","v":0}]
[66,null,{"$f":"IF(E73=\"\",\"\",VLOOKUP(E73,PRIJAVA!$B$35:$H$240,2,FALSE) & \" \" & VLOOKUP(E73,PRIJAVA!$B$35:$H$240,3,FALSE))","v":""},{"$f":"IF(E73=\"\",\"\",VLOOKUP(E73,PRIJAVA!$B$35:$H$240,5,FALSE))","v":""},null,{"$f":"IF(E73=\"\",\"\",VLOOKUP(E73,PRIJAVA!$B$35:$H$240,7,FALSE))","v":""},null,null,null,null,null,null,null,null,0]
[67,null,{"$f":"IF(E74=\"\",\"\",VLOOKUP(E74,PRIJAVA!$B$35:$H$240,2,FALSE) & \" \" & VLOOKUP(E74,PRIJAVA!$B$35:$H$240,3,FALSE))","v":""},{"$f":"IF(E74=\"\",\"\",VLOOKUP(E74,PRIJAVA!$B$35:$H$240,5,FALSE))","v":""},null,{"$f":"IF(E74=\"\",\"\",VLOOKUP(E74,PRIJAVA!$B$35:$H$240,7,FALSE))","v":""},null,null,null,null,null,null,null,null,0]
[68,null,{"$f":"IF(E75=\"\",\"\",VLOOKUP(E75,PRIJAVA!$B$35:$H$240,2,FALSE) & \" \" & VLOOKUP(E75,PRIJAVA!$B$35:$H$240,3,FALSE))","v":""},{"$f":"IF(E75=\"\",\"\",VLOOKUP(E75,PRIJAVA!$B$35:$H$240,5,FALSE))","v":""},null,{"$f":"IF(E75=\"\",\"\",VLOOKUP(E75,PRIJAVA!$B$35:$H$240,7,FALSE))","v":""},null,null,null,null,null,null,null,null,0]
[69,null,{"$f":"IF(E76=\"\",\"\",VLOOKUP(E76,PRIJAVA!$B$35:$H$240,2,FALSE) & \" \" & VLOOKUP(E76,PRIJAVA!$B$35:$H$240,3,FALSE))","v":""},{"$f":"IF(E76=\"\",\"\",VLOOKUP(E76,PRIJAVA!$B$35:$H$240,5,FALSE))","v":""},null,{"$f":"IF(E76=\"\",\"\",VLOOKUP(E76,PRIJAVA!$B$35:$H$240,7,FALSE))","v":""},null,null,null,null,null,null,null,null,0]
[70,null,{"$f":"IF(E77=\"\",\"\",VLOOKUP(E77,PRIJAVA!$B$35:$H$240,2,FALSE) & \" \" & VLOOKUP(E77,PRIJAVA!$B$35:$H$240,3,FALSE))","v":""},{"$f":"IF(E77=\"\",\"\",VLOOKUP(E77,PRIJAVA!$B$35:$H$240,5,FALSE))","v":""},null,{"$f":"IF(E77=\"\",\"\",VLOOKUP(E77,PRIJAVA!$B$35:$H$240,7,FALSE))","v":""},null,null,null,null,null,null,null,null,0]
[71,null,{"$f":"IF(E78=\"\",\"\",VLOOKUP(E78,PRIJAVA!$B$35:$H$240,2,FALSE) & \" \" & VLOOKUP(E78,PRIJAVA!$B$35:$H$240,3,FALSE))","v":""},{"$f":"IF(E78=\"\",\"\",VLOOKUP(E78,PRIJAVA!$B$35:$H$240,5,FALSE))","v":""},null,{"$f":"IF(E78=\"\",\"\",VLOOKUP(E78,PRIJAVA!$B$35:$H$240,7,FALSE))","v":""},null,null,null,null,null,null,null,null,0]
[72,null,{"$f":"IF(E79=\"\",\"\",VLOOKUP(E79,PRIJAVA!$B$35:$H$240,2,FALSE) & \" \" & VLOOKUP(E79,PRIJAVA!$B$35:$H$240,3,FALSE))","v":""},{"$f":"IF(E79=\"\",\"\",VLOOKUP(E79,PRIJAVA!$B$35:$H$240,5,FALSE))","v":""},null,{"$f":"IF(E79=\"\",\"\",VLOOKUP(E79,PRIJAVA!$B$35:$H$240,7,FALSE))","v":""},null,null,null,null,null,null,null,null,0]
[73,null,{"$f":"IF(E80=\"\",\"\",VLOOKUP(E80,PRIJAVA!$B$35:$H$240,2,FALSE) & \" \" & VLOOKUP(E80,PRIJAVA!$B$35:$H$240,3,FALSE))","v":""},{"$f":"IF(E80=\"\",\"\",VLOOKUP(E80,PRIJAVA!$B$35:$H$240,5,FALSE))","v":""},null,{"$f":"IF(E80=\"\",\"\",VLOOKUP(E80,PRIJAVA!$B$35:$H$240,7,FALSE))","v":""},null,null,null,null,null,null,null,null,0]
[74,null,{"$f":"IF(E81=\"\",\"\",VLOOKUP(E81,PRIJAVA!$B$35:$H$240,2,FALSE) & \" \" & VLOOKUP(E81,PRIJAVA!$B$35:$H$240,3,FALSE))","v":""},{"$f":"IF(E81=\"\",\"\",VLOOKUP(E81,PRIJAVA!$B$35:$H$240,5,FALSE))","v":""},null,{"$f":"IF(E81=\"\",\"\",VLOOKUP(E81,PRIJAVA!$B$35:$H$240,7,FALSE))","v":""},null,null,null,null,null,null,null,null,0]
[75,null,{"$f":"IF(E82=\"\",\"\",VLOOKUP(E82,PRIJAVA!$B$35:$H$240,2,FALSE) & \" \" & VLOOKUP(E82,PRIJAVA!$B$35:$H$240,3,FALSE))","v":""},{"$f":"IF(E82=\"\",\"\",VLOOKUP(E82,PRIJAVA!$B$35:$H$240,5,FALSE))","v":""},null,{"$f":"IF(E82=\"\",\"\",VLOOKUP(E82,PRIJAVA!$B$35:$H$240,7,FALSE))","v":""},null,null,null,null,null,null,null,null,0]
[76,null,{"$f":"IF(E83=\"\",\"\",VLOOKUP(E83,PRIJAVA!$B$35:$H$240,2,FALSE) & \" \" & VLOOKUP(E83,PRIJAVA!$B$35:$H$240,3,FALSE))","v":""},{"$f":"IF(E83=\"\",\"\",VLOOKUP(E83,PRIJAVA!$B$35:$H$240,5,FALSE))","v":""},null,{"$f":"IF(E83=\"\",\"\",VLOOKUP(E83,PRIJAVA!$B$35:$H$240,7,FALSE))","v":""},null,null,null,null,null,null,null,null,0]
[77,null,{"$f":"IF(E84=\"\",\"\",VLOOKUP(E84,PRIJAVA!$B$35:$H$240,2,FALSE) & \" \" & VLOOKUP(E84,PRIJAVA!$B$35:$H$240,3,FALSE))","v":""},{"$f":"IF(E84=\"\",\"\",VLOOKUP(E84,PRIJAVA!$B$35:$H$240,5,FALSE))","v":""},null,{"$f":"IF(E84=\"\",\"\",VLOOKUP(E84,PRIJAVA!$B$35:$H$240,7,FALSE))","v":""},null,null,null,null,null,null,null,null,0]
[78,null,{"$f":"IF(E85=\"\",\"\",VLOOKUP(E85,PRIJAVA!$B$35:$H$240,2,FALSE) & \" \" & VLOOKUP(E85,PRIJAVA!$B$35:$H$240,3,FALSE))","v":""},{"$f":"IF(E85=\"\",\"\",VLOOKUP(E85,PRIJAVA!$B$35:$H$240,5,FALSE))","v":""},null,{"$f":"IF(E85=\"\",\"\",VLOOKUP(E85,PRIJAVA!$B$35:$H$240,7,FALSE))","v":""},null,null,null,null,null,null,null,null,0]
[79,null,{"$f":"IF(E86=\"\",\"\",VLOOKUP(E86,PRIJAVA!$B$35:$H$240,2,FALSE) & \" \" & VLOOKUP(E86,PRIJAVA!$B$35:$H$240,3,FALSE))","v":""},{"$f":"IF(E86=\"\",\"\",VLOOKUP(E86,PRIJAVA!$B$35:$H$240,5,FALSE))","v":""},null,{"$f":"IF(E86=\"\",\"\",VLOOKUP(E86,PRIJAVA!$B$35:$H$240,7,FALSE))","v":""},null,null,null,null,null,null,null,null,0]
[80,null,{"$f":"IF(E87=\"\",\"\",VLOOKUP(E87,PRIJAVA!$B$35:$H$240,2,FALSE) & \" \" & VLOOKUP(E87,PRIJAVA!$B$35:$H$240,3,FALSE))","v":""},{"$f":"IF(E87=\"\",\"\",VLOOKUP(E87,PRIJAVA!$B$35:$H$240,5,FALSE))","v":""},null,{"$f":"IF(E87=\"\",\"\",VLOOKUP(E87,PRIJAVA!$B$35:$H$240,7,FALSE))","v":""},null,null,null,null,null,null,null,null,0]
[81,null,{"$f":"IF(E88=\"\",\"\",VLOOKUP(E88,PRIJAVA!$B$35:$H$240,2,FALSE) & \" \" & VLOOKUP(E88,PRIJAVA!$B$35:$H$240,3,FALSE))","v":""},{"$f":"IF(E88=\"\",\"\",VLOOKUP(E88,PRIJAVA!$B$35:$H$240,5,FALSE))","v":""},null,{"$f":"IF(E88=\"\",\"\",VLOOKUP(E88,PRIJAVA!$B$35:$H$240,7,FALSE))","v":""},null,null,null,null,null,null,null,null,0]
[82,null,{"$f":"IF(E89=\"\",\"\",VLOOKUP(E89,PRIJAVA!$B$35:$H$240,2,FALSE) & \" \" & VLOOKUP(E89,PRIJAVA!$B$35:$H$240,3,FALSE))","v":""},{"$f":"IF(E89=\"\",\"\",VLOOKUP(E89,PRIJAVA!$B$35:$H$240,5,FALSE))","v":""},null,{"$f":"IF(E89=\"\",\"\",VLOOKUP(E89,PRIJAVA!$B$35:$H$240,7,FALSE))","v":""},null,null,null,null,null,null,null,null,0]
[83,null,{"$f":"IF(E90=\"\",\"\",VLOOKUP(E90,PRIJAVA!$B$35:$H$240,2,FALSE) & \" \" & VLOOKUP(E90,PRIJAVA!$B$35:$H$240,3,FALSE))","v":""},{"$f":"IF(E90=\"\",\"\",VLOOKUP(E90,PRIJAVA!$B$35:$H$240,5,FALSE))","v":""},null,{"$f":"IF(E90=\"\",\"\",VLOOKUP(E90,PRIJAVA!$B$35:$H$240,7,FALSE))","v":""},null,null,null,null,null,null,null,null,0]
[84,null,{"$f":"IF(E91=\"\",\"\",VLOOKUP(E91,PRIJAVA!$B$35:$H$240,2,FALSE) & \" \" & VLOOKUP(E91,PRIJAVA!$B$35:$H$240,3,FALSE))","v":""},{"$f":"IF(E91=\"\",\"\",VLOOKUP(E91,PRIJAVA!$B$35:$H$240,5,FALSE))","v":""},null,{"$f":"IF(E91=\"\",\"\",VLOOKUP(E91,PRIJAVA!$B$35:$H$240,7,FALSE))","v":""},null,null,null,null,null,null,null,null,0]
[85,null,{"$f":"IF(E92=\"\",\"\",VLOOKUP(E92,PRIJAVA!$B$35:$H$240,2,FALSE) & \" \" & VLOOKUP(E92,PRIJAVA!$B$35:$H$240,3,FALSE))","v":""},{"$f":"IF(E92=\"\",\"\",VLOOKUP(E92,PRIJAVA!$B$35:$H$240,5,FALSE))","v":""},null,{"$f":"IF(E92=\"\",\"\",VLOOKUP(E92,PRIJAVA!$B$35:$H$240,7,FALSE))","v":""},null,null,null,null,null,null,null,null,0]
[86,null,{"$f":"IF(E93=\"\",\"\",VLOOKUP(E93,PRIJAVA!$B$35:$H$240,2,FALSE) & \" \" & VLOOKUP(E93,PRIJAVA!$B$35:$H$240,3,FALSE))","v":""},{"$f":"IF(E93=\"\",\"\",VLOOKUP(E93,PRIJAVA!$B$35:$H$240,5,FALSE))","v":""},null,{"$f":"IF(E93=\"\",\"\",VLOOKUP(E93,PRIJAVA!$B$35:$H$240,7,FALSE))","v":""},null,null,null,null,null,null,null,null,0]
[87,null,{"$f":"IF(E94=\"\",\"\",VLOOKUP(E94,PRIJAVA!$B$35:$H$240,2,FALSE) & \" \" & VLOOKUP(E94,PRIJAVA!$B$35:$H$240,3,FALSE))","v":""},{"$f":"IF(E94=\"\",\"\",VLOOKUP(E94,PRIJAVA!$B$35:$H$240,5,FALSE))","v":""},null,{"$f":"IF(E94=\"\",\"\",VLOOKUP(E94,PRIJAVA!$B$35:$H$240,7,FALSE))","v":""},null,null,null,null,null,null,null,null,0]
[88,null,{"$f":"IF(E95=\"\",\"\",VLOOKUP(E95,PRIJAVA!$B$35:$H$240,2,FALSE) & \" \" & VLOOKUP(E95,PRIJAVA!$B$35:$H$240,3,FALSE))","v":""},{"$f":"IF(E95=\"\",\"\",VLOOKUP(E95,PRIJAVA!$B$35:$H$240,5,FALSE))","v":""},null,{"$f":"IF(E95=\"\",\"\",VLOOKUP(E95,PRIJAVA!$B$35:$H$240,7,FALSE))","v":""},null,null,null,null,null,null,null,null,0]
[89,null,{"$f":"IF(E96=\"\",\"\",VLOOKUP(E96,PRIJAVA!$B$35:$H$240,2,FALSE) & \" \" & VLOOKUP(E96,PRIJAVA!$B$35:$H$240,3,FALSE))","v":""},{"$f":"IF(E96=\"\",\"\",VLOOKUP(E96,PRIJAVA!$B$35:$H$240,5,FALSE))","v":""},null,{"$f":"IF(E96=\"\",\"\",VLOOKUP(E96,PRIJAVA!$B$35:$H$240,7,FALSE))","v":""},null,null,null,null,null,null,null,null,0]
[90,null,{"$f":"IF(E97=\"\",\"\",VLOOKUP(E97,PRIJAVA!$B$35:$H$240,2,FALSE) & \" \" & VLOOKUP(E97,PRIJAVA!$B$35:$H$240,3,FALSE))","v":""},{"$f":"IF(E97=\"\",\"\",VLOOKUP(E97,PRIJAVA!$B$35:$H$240,5,FALSE))","v":""},null,{"$f":"IF(E97=\"\",\"\",VLOOKUP(E97,PRIJAVA!$B$35:$H$240,7,FALSE))","v":""},null,null,null,null,null,null,null,null,0]
[91,null,{"$f":"IF(E98=\"\",\"\",VLOOKUP(E98,PRIJAVA!$B$35:$H$240,2,FALSE) & \" \" & VLOOKUP(E98,PRIJAVA!$B$35:$H$240,3,FALSE))","v":""},{"$f":"IF(E98=\"\",\"\",VLOOKUP(E98,PRIJAVA!$B$35:$H$240,5,FALSE))","v":""},null,{"$f":"IF(E98=\"\",\"\",VLOOKUP(E98,PRIJAVA!$B$35:$H$240,7,FALSE))","v":""},null,null,null,null,null,null,null,null,0]
[92,null,{"$f":"IF(E99=\"\",\"\",VLOOKUP(E99,PRIJAVA!$B$35:$H$240,2,FALSE) & \" \" & VLOOKUP(E99,PRIJAVA!$B$35:$H$240,3,FALSE))","v":""},{"$f":"IF(E99=\"\",\"\",VLOOKUP(E99,PRIJAVA!$B$35:$H$240,5,FALSE))","v":""},null,{"$f":"IF(E99=\"\",\"\",VLOOKUP(E99,PRIJAVA!$B$35:$H$240,7,FALSE))","v":""},null,null,null,null,null,null,null,null,0]
[93,null,{"$f":"IF(E100=\"\",\"\",VLOOKUP(E100,PRIJAVA!$B$35:$H$240,2,FALSE) & \" \" & VLOOKUP(E100,PRIJAVA!$B$35:$H$240,3,FALSE))","v":""},{"$f":"IF(E100=\"\",\"\",VLOOKUP(E100,PRIJAVA!$B$35:$H$240,5,FALSE))","v":""},null,{"$f":"IF(E100=\"\",\"\",VLOOKUP(E100,PRIJAVA!$B$35:$H$240,7,FALSE))","v":""},null,null,null,null,null,null,null,null,0,null,null,null,null,null,{"$f":"IF(T102=\"\",\"\",VLOOKUP(T102,PRIJAVA!$B$35:$H$240,7,FALSE))","v":"SD Domžale"}]
[94,null,{"$f":"IF(E101=\"\",\"\",VLOOKUP(E101,PRIJAVA!$B$35:$H$240,2,FALSE) & \" \" & VLOOKUP(E101,PRIJAVA!$B$35:$H$240,3,FALSE))","v":""},{"$f":"IF(E101=\"\",\"\",VLOOKUP(E101,PRIJAVA!$B$35:$H$240,5,FALSE))","v":""},null,{"$f":"IF(E101=\"\",\"\",VLOOKUP(E101,PRIJAVA!$B$35:$H$240,7,FALSE))","v":""},null,null,null,null,null,null,null,null,0,null,null,null,null,"BIB","Priimek in ime","1. ser","2. ser","3. ser","4. ser","1. ser","2. ser","3. ser","4. ser","skupno","nc*"]
[95,null,{"$f":"IF(E102=\"\",\"\",VLOOKUP(E102,PRIJAVA!$B$35:$H$240,2,FALSE) & \" \" & VLOOKUP(E102,PRIJAVA!$B$35:$H$240,3,FALSE))","v":""},{"$f":"IF(E102=\"\",\"\",VLOOKUP(E102,PRIJAVA!$B$35:$H$240,5,FALSE))","v":""},null,{"$f":"IF(E102=\"\",\"\",VLOOKUP(E102,PRIJAVA!$B$35:$H$240,7,FALSE))","v":""},null,null,null,null,null,null,null,null,0,null,null,null,null,10365,{"$f":"IF(T102=\"\",\"\",VLOOKUP(T102,PRIJAVA!$B$35:$H$240,2,FALSE) & \" \" & VLOOKUP(T102,PRIJAVA!$B$35:$H$240,3,FALSE))","v":"ŠTIFTAR Jurij"},{"$f":"IF(U102=\"\",\"\",VLOOKUP(U102,$C$8:$N$106,5,FALSE))","v":0},{"$f":"IF(U102=\"\",\"\",VLOOKUP(U102,$C$8:$N$106,6,FALSE))","v":0},{"$f":"IF(U102=\"\",\"\",VLOOKUP(U102,$C$8:$N$106,7,FALSE))","v":0},{"$f":"IF(U102=\"\",\"\",VLOOKUP(U102,$C$8:$N$106,8,FALSE))","v":0},{"$f":"IF(U102=\"\",\"\",VLOOKUP(U102,$C$8:$N$106,9,FALSE))","v":86},{"$f":"IF(U102=\"\",\"\",VLOOKUP(U102,$C$8:$L$106,10,FALSE))","v":82},{"$f":"IF(V102=\"\",\"\",VLOOKUP(U102,$C$8:$M$106,11,FALSE))","v":87},{"$f":"IF(U102=\"\",\"\",VLOOKUP(U102,$C$8:$N$106,12,FALSE))","v":81},{"$f":"SUM(V102:AC102)","v":336},{"$f":"IF(U102=\"\",\"\",VLOOKUP(U102,$C$8:$P$106,14,FALSE))","v":3}]
[96,null,{"$f":"IF(E103=\"\",\"\",VLOOKUP(E103,PRIJAVA!$B$35:$H$240,2,FALSE) & \" \" & VLOOKUP(E103,PRIJAVA!$B$35:$H$240,3,FALSE))","v":""},{"$f":"IF(E103=\"\",\"\",VLOOKUP(E103,PRIJAVA!$B$35:$H$240,5,FALSE))","v":""},null,{"$f":"IF(E103=\"\",\"\",VLOOKUP(E103,PRIJAVA!$B$35:$H$240,7,FALSE))","v":""},null,null,null,null,null,null,null,null,0,null,null,null,null,10177,{"$f":"IF(T103=\"\",\"\",VLOOKUP(T103,PRIJAVA!$B$35:$H$240,2,FALSE) & \" \" & VLOOKUP(T103,PRIJAVA!$B$35:$H$240,3,FALSE))","v":"DIMIC Klemen"},{"$f":"IF(U103=\"\",\"\",VLOOKUP(U103,$C$8:$N$106,5,FALSE))","v":0},{"$f":"IF(U103=\"\",\"\",VLOOKUP(U103,$C$8:$N$106,6,FALSE))","v":0},{"$f":"IF(U103=\"\",\"\",VLOOKUP(U103,$C$8:$N$106,7,FALSE))","v":0},{"$f":"IF(U103=\"\",\"\",VLOOKUP(U103,$C$8:$N$106,8,FALSE))","v":0},{"$f":"IF(U103=\"\",\"\",VLOOKUP(U103,$C$8:$N$106,9,FALSE))","v":86},{"$f":"IF(U103=\"\",\"\",VLOOKUP(U103,$C$8:$L$106,10,FALSE))","v":82},{"$f":"IF(V103=\"\",\"\",VLOOKUP(U103,$C$8:$M$106,11,FALSE))","v":84},{"$f":"IF(U103=\"\",\"\",VLOOKUP(U103,$C$8:$N$106,12,FALSE))","v":89},{"$f":"SUM(V103:AC103)","v":341},{"$f":"IF(U103=\"\",\"\",VLOOKUP(U103,$C$8:$P$106,14,FALSE))","v":1}]
[null,null,null,null,null,null,null,null,null,null,null,null,null,null,null,null,null,null,null,14973,{"$f":"IF(T104=\"\",\"\",VLOOKUP(T104,PRIJAVA!$B$35:$H$240,2,FALSE) & \" \" & VLOOKUP(T104,PRIJAVA!$B$35:$H$240,3,FALSE))","v":{"$error":"#N/A"}},{"$f":"IF(U104=\"\",\"\",VLOOKUP(U104,$C$8:$N$106,5,FALSE))","v":{"$error":"#N/A"}},{"$f":"IF(U104=\"\",\"\",VLOOKUP(U104,$C$8:$N$106,6,FALSE))","v":{"$error":"#N/A"}},{"$f":"IF(U104=\"\",\"\",VLOOKUP(U104,$C$8:$N$106,7,FALSE))","v":{"$error":"#N/A"}},{"$f":"IF(U104=\"\",\"\",VLOOKUP(U104,$C$8:$N$106,8,FALSE))","v":{"$error":"#N/A"}},{"$f":"IF(U104=\"\",\"\",VLOOKUP(U104,$C$8:$N$106,9,FALSE))","v":{"$error":"#N/A"}},{"$f":"IF(U104=\"\",\"\",VLOOKUP(U104,$C$8:$L$106,10,FALSE))","v":{"$error":"#N/A"}},{"$f":"IF(V104=\"\",\"\",VLOOKUP(U104,$C$8:$M$106,11,FALSE))","v":{"$error":"#N/A"}},{"$f":"IF(U104=\"\",\"\",VLOOKUP(U104,$C$8:$N$106,12,FALSE))","v":{"$error":"#N/A"}},{"$f":"SUM(V104:AC104)","v":{"$error":"#N/A"}},{"$f":"IF(U104=\"\",\"\",VLOOKUP(U104,$C$8:$P$106,14,FALSE))","v":{"$error":"#N/A"}}]
[null,null,null,null,null,null,null,null,null,null,null,null,null,null,null,null,null,null,null,null,null,null,null,null,null,null,null,null,{"$f":"SUM(AC102:AC104)","v":{"$error":"#N/A"}},{"$f":"SUM(AD102:AD104)","v":{"$error":"#N/A"}},{"$f":"SUM(AE102:AE104)","v":{"$error":"#N/A"}}]

{"sheet":"2.DL PUŠKA","index":3,"n_rows":103,"n_cols":31,"rows_kept":103,"cut":false,"hidden":false,"merged":[[1,0,1,30],[3,2,3,14],[4,0,6,0],[4,1,6,1],[4,2,4,14]]}
[]
["Iz zavihka Prijava se za tekmovalca v seznam za rezultate v stolpec E vpiše BIB številka od vrstice 5 dalje. Po vpisu BIB bo preneslo vse podatke v ta seznam, kjer se nato vpisujejo rezultati. Vpiše se rezultat serije v stolpec K, L, M, N  ter nc*. Prav tako se za upoštevanje rezultata ekipno vpišejo samo BIB številke v stolpcu T za vse tri člane ekipe, ki je lahko mešana. Prenos ostalih podatkov je samodejen.  Posamezno se lahko razvrsti, ekipno ostane nerazvrščeno. Dokument mora imeti omogočen makro."]
[]
[null,null,"II. LIGA PUŠKA 4. SZ REGIJA"]
["mesto",null,"SD KAMNIK"]
[]
[null,null,"Priimek in ime","Roj.skrita","BIB","Društvo, klub","1. ser","2. ser","3. ser","4. ser","1. ser","2. ser","3. ser","4. ser","skupno","nc*"]
[1,null,{"$f":"IF(E8=\"\",\"\",VLOOKUP(E8,PRIJAVA!$B$35:$H$240,2,FALSE) & \" \" & VLOOKUP(E8,PRIJAVA!$B$35:$H$240,3,FALSE))","v":"JAKSETIČ Tristan"},{"$f":"IF(E8=\"\",\"\",VLOOKUP(E8,PRIJAVA!$B$35:$H$240,5,FALSE))","v":2010},15975,{"$f":"IF(E8=\"\",\"\",VLOOKUP(E8,PRIJAVA!$B$35:$H$240,7,FALSE))","v":"SD Kamnik"},null,null,null,null,96.6,98.3,94.5,97.1,{"$f":"SUM(G8:N8)","v":386.5},7,null,null,null,null,"EKIPNO: "]
[2,null,{"$f":"IF(E9=\"\",\"\",VLOOKUP(E9,PRIJAVA!$B$35:$H$240,2,FALSE) & \" \" & VLOOKUP(E9,PRIJAVA!$B$35:$H$240,3,FALSE))","v":"AHLIN Veronika"},{"$f":"IF(E9=\"\",\"\",VLOOKUP(E9,PRIJAVA!$B$35:$H$240,5,FALSE))","v":2008},14897,{"$f":"IF(E9=\"\",\"\",VLOOKUP(E9,PRIJAVA!$B$35:$H$240,7,FALSE))","v":"SD Kamnik"},null,null,null,null,103.6,99.6,101.4,102.9,407.5,22]
[3,null,{"$f":"IF(E10=\"\",\"\",VLOOKUP(E10,PRIJAVA!$B$35:$H$240,2,FALSE) & \" \" & VLOOKUP(E10,PRIJAVA!$B$35:$H$240,3,FALSE))","v":"JERMOL Gaber"},{"$f":"IF(E10=\"\",\"\",VLOOKUP(E10,PRIJAVA!$B$35:$H$240,5,FALSE))","v":2010},15693,{"$f":"IF(E10=\"\",\"\",VLOOKUP(E10,PRIJAVA!$B$35:$H$240,7,FALSE))","v":"SD Kamnik"},null,null,null,null,88.4,95.5,94.8,86,364.7,6,null,null,null,null,{"$f":"IF(T12=\"\",\"\",VLOOKUP(T12,PRIJAVA!$B$35:$H$240,7,FALSE))","v":"SD Kamnik"}]
[4,null,{"$f":"IF(E11=\"\",\"\",VLOOKUP(E11,PRIJAVA!$B$35:$H$240,2,FALSE) & \" \" & VLOOKUP(E11,PRIJAVA!$B$35:$H$240,3,FALSE))","v":"ČEMAŽAR Neža"},2008,15650,{"$f":"IF(E11=\"\",\"\",VLOOKUP(E11,PRIJAVA!$B$35:$H$240,7,FALSE))","v":"SD Lotrič Železniki"},null,null,null,null,86.9,98.2,98.3,95.2,378.6,14,null,null,null,"BIB","Priimek in ime","1. ser","2. ser","3. ser","4. ser","1. ser","2. ser","3. ser","4. ser","skupno","nc*"]
[5,null,{"$f":"IF(E12=\"\",\"\",VLOOKUP(E12,PRIJAVA!$B$35:$H$240,2,FALSE) & \" \" & VLOOKUP(E12,PRIJAVA!$B$35:$H$240,3,FALSE))","v":"KOBLAR Amadej"},{"$f":"IF(E12=\"\",\"\",VLOOKUP(E12,PRIJAVA!$B$35:$H$240,5,FALSE))","v":2007},14548,{"$f":"IF(E12=\"\",\"\",VLOOKUP(E12,PRIJAVA!$B$35:$H$240,7,FALSE))","v":"SD Lotrič Železniki"},null,null,null,null,93.2,95.5,94.2,93.6,376.5,9,null,null,null,15975,{"$f":"IF(T12=\"\",\"\",VLOOKUP(T12,PRIJAVA!$B$35:$H$240,2,FALSE) & \" \" & VLOOKUP(T12,PRIJAVA!$B$35:$H$240,3,FALSE))","v":"JAKSETIČ Tristan"},{"$f":"IF(U12=\"\",\"\",VLOOKUP(U12,$C$8:$N$106,5,FALSE))","v":0},{"$f":"IF(U12=\"\",\"\",VLOOKUP(U12,$C$8:$N$106,6,FALSE))","v":0},{"$f":"IF(U12=\"\",\"\",VLOOKUP(U12,$C$8:$N$106,7,FALSE))","v":0},{"$f":"IF(U12=\"\",\"\",VLOOKUP(U12,$C$8:$N$106,8,FALSE))","v":0},{"$f":"IF(U12=\"\",\"\",VLOOKUP(U12,$C$8:$N$106,9,FALSE))","v":96.6},{"$f":"IF(U12=\"\",\"\",VLOOKUP(U12,$C$8:$L$106,10,FALSE))","v":98.3},{"$f":"IF(V12=\"\",\"\",VLOOKUP(U12,$C$8:$M$106,11,FALSE))","v":94.5},{"$f":"IF(U12=\"\",\"\",VLOOKUP(U12,$C$8:$N$106,12,FALSE))","v":97.1},{"$f":"SUM(V12:AC12)","v":386.5},{"$f":"IF(U12=\"\",\"\",VLOOKUP(U12,$C$8:$P$106,14,FALSE))","v":7}]
[6,null,{"$f":"IF(E13=\"\",\"\",VLOOKUP(E13,PRIJAVA!$B$35:$H$240,2,FALSE) & \" \" & VLOOKUP(E13,PRIJAVA!$B$35:$H$240,3,FALSE))","v":"ŠUBIC Toni"},{"$f":"IF(E13=\"\",\"\",VLOOKUP(E13,PRIJAVA!$B$35:$H$240,5,FALSE))","v":2007},15788,{"$f":"IF(E13=\"\",\"\",VLOOKUP(E13,PRIJAVA!$B$35:$H$240,7,FALSE))","v":"SD Lotrič Železniki"},null,null,null,null,97.2,92.5,95.1,95.9,380.69999999999993,8,null,null,null,14897,{"$f":"IF(T13=\"\",\"\",VLOOKUP(T13,PRIJAVA!$B$35:$H$240,2,FALSE) & \" \" & VLOOKUP(T13,PRIJAVA!$B$35:$H$240,3,FALSE))","v":"AHLIN Veronika"},{"$f":"IF(U13=\"\",\"\",VLOOKUP(U13,$C$8:$N$106,5,FALSE))","v":0},{"$f":"IF(U13=\"\",\"\",VLOOKUP(U13,$C$8:$N$106,6,FALSE))","v":0},{"$f":"IF(U13=\"\",\"\",VLOOKUP(U13,$C$8:$N$106,7,FALSE))","v":0},{"$f":"IF(U13=\"\",\"\",VLOOKUP(U13,$C$8:$N$106,8,FALSE))","v":0},{"$f":"IF(U13=\"\",\"\",VLOOKUP(U13,$C$8:$N$106,9,FALSE))","v":103.6},{"$f":"IF(U13=\"\",\"\",VLOOKUP(U13,$C$8:$L$106,10,FALSE))","v":99.6},{"$f":"IF(V13=\"\",\"\",VLOOKUP(U13,$C$8:$M$106,11,FALSE))","v":101.4},{"$f":"IF(U13=\"\",\"\",VLOOKUP(U13,$C$8:$N$106,12,FALSE))","v":102.9},{"$f":"SUM(V13:AC13)","v":407.5},{"$f":"IF(U13=\"\",\"\",VLOOKUP(U13,$C$8:$P$106,14,FALSE))","v":22}]
[7,null,{"$f":"IF(E14=\"\",\"\",VLOOKUP(E14,PRIJAVA!$B$35:$H$240,2,FALSE) & \" \" & VLOOKUP(E14,PRIJAVA!$B$35:$H$240,3,FALSE))","v":"ZUPIN Nejc"},{"$f":"IF(E14=\"\",\"\",VLOOKUP(E14,PRIJAVA!$B$35:$H$240,5,FALSE))","v":2009},16215,{"$f":"IF(E14=\"\",\"\",VLOOKUP(E14,PRIJAVA!$B$35:$H$240,7,FALSE))","v":"SD Preddvor"},null,null,null,null,96.5,90.8,88.5,95.3,371.1,5,null,null,null,10313,{"$f":"IF(T14=\"\",\"\",VLOOKUP(T14,PRIJAVA!$B$35:$H$240,2,FALSE) & \" \" & VLOOKUP(T14,PRIJAVA!$B$35:$H$240,3,FALSE))","v":"FABJAN Boštjan"},{"$f":"IF(U14=\"\",\"\",VLOOKUP(U14,$C$8:$N$106,5,FALSE))","v":0},{"$f":"IF(U14=\"\",\"\",VLOOKUP(U14,$C$8:$N$106,6,FALSE))","v":0},{"$f":"IF(U14=\"\",\"\",VLOOKUP(U14,$C$8:$N$106,7,FALSE))","v":0},{"$f":"IF(U14=\"\",\"\",VLOOKUP(U14,$C$8:$N$106,8,FALSE))","v":0},{"$f":"IF(U14=\"\",\"\",VLOOKUP(U14,$C$8:$N$106,9,FALSE))","v":101.6},{"$f":"IF(U14=\"\",\"\",VLOOKUP(U14,$C$8:$L$106,10,FALSE))","v":101.1},{"$f":"IF(V14=\"\",\"\",VLOOKUP(U14,$C$8:$M$106,11,FALSE))","v":100.3},{"$f":"IF(U14=\"\",\"\",VLOOKUP(U14,$C$8:$N$106,12,FALSE))","v":99.2},{"$f":"SUM(V14:AC14)","v":402.2},{"$f":"IF(U14=\"\",\"\",VLOOKUP(U14,$C$8:$P$106,14,FALSE))","v":19}]
[8,null,{"$f":"IF(E15=\"\",\"\",VLOOKUP(E15,PRIJAVA!$B$35:$H$240,2,FALSE) & \" \" & VLOOKUP(E15,PRIJAVA!$B$35:$H$240,3,FALSE))","v":"GAŠPERLIN Lana"},{"$f":"IF(E15=\"\",\"\",VLOOKUP(E15,PRIJAVA!$B$35:$H$240,5,FALSE))","v":2008},15983,{"$f":"IF(E15=\"\",\"\",VLOOKUP(E15,PRIJAVA!$B$35:$H$240,7,FALSE))","v":"SD Preddvor"},null,null,null,null,98.9,95.5,93.8,90.2,378.4,8,null,null,null,null,null,null,null,null,null,null,null,null,{"$f":"SUM(AC12:AC14)","v":299.2},{"$f":"SUM(AD12:AD14)","v":1196.2},{"$f":"SUM(AE12:AE14)","v":48}]
[9,null,{"$f":"IF(E16=\"\",\"\",VLOOKUP(E16,PRIJAVA!$B$35:$H$240,2,FALSE) & \" \" & VLOOKUP(E16,PRIJAVA!$B$35:$H$240,3,FALSE))","v":"RAJGELJ Sergej"},{"$f":"IF(E16=\"\",\"\",VLOOKUP(E16,PRIJAVA!$B$35:$H$240,5,FALSE))","v":2005},13844,{"$f":"IF(E16=\"\",\"\",VLOOKUP(E16,PRIJAVA!$B$35:$H$240,7,FALSE))","v":"SD Preddvor"},null,null,null,null,96.3,93.4,90.2,95.6,375.5,8]
[10,null,{"$f":"IF(E17=\"\",\"\",VLOOKUP(E17,PRIJAVA!$B$35:$H$240,2,FALSE) & \" \" & VLOOKUP(E17,PRIJAVA!$B$35:$H$240,3,FALSE))","v":"AHAČIČ SREDNIK Nika"},{"$f":"IF(E17=\"\",\"\",VLOOKUP(E17,PRIJAVA!$B$35:$H$240,5,FALSE))","v":1960},14863,{"$f":"IF(E17=\"\",\"\",VLOOKUP(E17,PRIJAVA!$B$35:$H$240,7,FALSE))","v":"SD Lotrič Železniki"},null,null,null,null,84.9,96.8,93,92.9,367.6,8]
[11,null,{"$f":"IF(E18=\"\",\"\",VLOOKUP(E18,PRIJAVA!$B$35:$H$240,2,FALSE) & \" \" & VLOOKUP(E18,PRIJAVA!$B$35:$H$240,3,FALSE))","v":"GRAŠIČ Lovro"},{"$f":"IF(E18=\"\",\"\",VLOOKUP(E18,PRIJAVA!$B$35:$H$240,5,FALSE))","v":2008},16229,{"$f":"IF(E18=\"\",\"\",VLOOKUP(E18,PRIJAVA!$B$35:$H$240,7,FALSE))","v":"SD Škofja Loka"},null,null,null,null,93.5,93.8,96.1,97.8,381.2,6,null,null,null,null,{"$f":"IF(T20=\"\",\"\",VLOOKUP(T20,PRIJAVA!$B$35:$H$240,7,FALSE))","v":"SD Preddvor"}]
[12,null,{"$f":"IF(E19=\"\",\"\",VLOOKUP(E19,PRIJAVA!$B$35:$H$240,2,FALSE) & \" \" & VLOOKUP(E19,PRIJAVA!$B$35:$H$240,3,FALSE))","v":"GABER Luka"},{"$f":"IF(E19=\"\",\"\",VLOOKUP(E19,PRIJAVA!$B$35:$H$240,5,FALSE))","v":2008},14600,{"$f":"IF(E19=\"\",\"\",VLOOKUP(E19,PRIJAVA!$B$35:$H$240,7,FALSE))","v":"SD Škofja Loka"},null,null,null,null,100.6,99.4,102.2,99.8,402,20,null,null,null,"BIB","Priimek in ime","1. ser","2. ser","3. ser","4. ser","1. ser","2. ser","3. ser","4. ser","skupno","nc*"]
[13,null,{"$f":"IF(E20=\"\",\"\",VLOOKUP(E20,PRIJAVA!$B$35:$H$240,2,FALSE) & \" \" & VLOOKUP(E20,PRIJAVA!$B$35:$H$240,3,FALSE))","v":"KOPRIVNIKAR Žiga"},{"$f":"IF(E20=\"\",\"\",VLOOKUP(E20,PRIJAVA!$B$35:$H$240,5,FALSE))","v":2008},14599,{"$f":"IF(E20=\"\",\"\",VLOOKUP(E20,PRIJAVA!$B$35:$H$240,7,FALSE))","v":"SD Škofja Loka"},null,null,null,null,95.6,86.3,94.5,95,371.4,5,null,null,null,16215,{"$f":"IF(T20=\"\",\"\",VLOOKUP(T20,PRIJAVA!$B$35:$H$240,2,FALSE) & \" \" & VLOOKUP(T20,PRIJAVA!$B$35:$H$240,3,FALSE))","v":"ZUPIN Nejc"},{"$f":"IF(U20=\"\",\"\",VLOOKUP(U20,$C$8:$N$106,5,FALSE))","v":0},{"$f":"IF(U20=\"\",\"\",VLOOKUP(U20,$C$8:$N$106,6,FALSE))","v":0},{"$f":"IF(U20=\"\",\"\",VLOOKUP(U20,$C$8:$N$106,7,FALSE))","v":0},{"$f":"IF(U20=\"\",\"\",VLOOKUP(U20,$C$8:$N$106,8,FALSE))","v":0},{"$f":"IF(U20=\"\",\"\",VLOOKUP(U20,$C$8:$N$106,9,FALSE))","v":96.5},{"$f":"IF(U20=\"\",\"\",VLOOKUP(U20,$C$8:$L$106,10,FALSE))","v":90.8},{"$f":"IF(V20=\"\",\"\",VLOOKUP(U20,$C$8:$M$106,11,FALSE))","v":88.5},{"$f":"IF(U20=\"\",\"\",VLOOKUP(U20,$C$8:$N$106,12,FALSE))","v":95.3},{"$f":"SUM(V20:AC20)","v":371.1},{"$f":"IF(U20=\"\",\"\",VLOOKUP(U20,$C$8:$P$106,14,FALSE))","v":5}]
[14,null,{"$f":"IF(E21=\"\",\"\",VLOOKUP(E21,PRIJAVA!$B$35:$H$240,2,FALSE) & \" \" & VLOOKUP(E21,PRIJAVA!$B$35:$H$240,3,FALSE))","v":"BENEDIČIČ Manca"},{"$f":"IF(E21=\"\",\"\",VLOOKUP(E21,PRIJAVA!$B$35:$H$240,5,FALSE))","v":2008},15648,{"$f":"IF(E21=\"\",\"\",VLOOKUP(E21,PRIJAVA!$B$35:$H$240,7,FALSE))","v":"SD Lotrič Železniki"},null,null,null,null,99.2,99.9,97.2,96.9,393.20000000000005,10,null,null,null,15983,{"$f":"IF(T21=\"\",\"\",VLOOKUP(T21,PRIJAVA!$B$35:$H$240,2,FALSE) & \" \" & VLOOKUP(T21,PRIJAVA!$B$35:$H$240,3,FALSE))","v":"GAŠPERLIN Lana"},{"$f":"IF(U21=\"\",\"\",VLOOKUP(U21,$C$8:$N$106,5,FALSE))","v":0},{"$f":"IF(U21=\"\",\"\",VLOOKUP(U21,$C$8:$N$106,6,FALSE))","v":0},{"$f":"IF(U21=\"\",\"\",VLOOKUP(U21,$C$8:$N$106,7,FALSE))","v":0},{"$f":"IF(U21=\"\",\"\",VLOOKUP(U21,$C$8:$N$106,8,FALSE))","v":0},{"$f":"IF(U21=\"\",\"\",VLOOKUP(U21,$C$8:$N$106,9,FALSE))","v":98.9},{"$f":"IF(U21=\"\",\"\",VLOOKUP(U21,$C$8:$L$106,10,FALSE))","v":95.5},{"$f":"IF(V21=\"\",\"\",VLOOKUP(U21,$C$8:$M$106,11,FALSE))","v":93.8},{"$f":"IF(U21=\"\",\"\",VLOOKUP(U21,$C$8:$N$106,12,FALSE))","v":90.2},{"$f":"SUM(V21:AC21)","v":378.4},{"$f":"IF(U21=\"\",\"\",VLOOKUP(U21,$C$8:$P$106,14,FALSE))","v":8}]
[15,null,{"$f":"IF(E22=\"\",\"\",VLOOKUP(E22,PRIJAVA!$B$35:$H$240,2,FALSE) & \" \" & VLOOKUP(E22,PRIJAVA!$B$35:$H$240,3,FALSE))","v":"BRATINA Jakob"},2007,14547,{"$f":"IF(E22=\"\",\"\",VLOOKUP(E22,PRIJAVA!$B$35:$H$240,7,FALSE))","v":"SD Lotrič Železniki"},null,null,null,null,95.2,97.2,92,91.5,{"$f":"SUM(K22:N22)","v":375.9},6,null,null,null,13844,{"$f":"IF(T22=\"\",\"\",VLOOKUP(T22,PRIJAVA!$B$35:$H$240,2,FALSE) & \" \" & VLOOKUP(T22,PRIJAVA!$B$35:$H$240,3,FALSE))","v":"RAJGELJ Sergej"},{"$f":"IF(U22=\"\",\"\",VLOOKUP(U22,$C$8:$N$106,5,FALSE))","v":0},{"$f":"IF(U22=\"\",\"\",VLOOKUP(U22,$C$8:$N$106,6,FALSE))","v":0},{"$f":"IF(U22=\"\",\"\",VLOOKUP(U22,$C$8:$N$106,7,FALSE))","v":0},{"$f":"IF(U22=\"\",\"\",VLOOKUP(U22,$C$8:$N$106,8,FALSE))","v":0},{"$f":"IF(U22=\"\",\"\",VLOOKUP(U22,$C$8:$N$106,9,FALSE))","v":96.3},{"$f":"IF(U22=\"\",\"\",VLOOKUP(U22,$C$8:$L$106,10,FALSE))","v":93.4},{"$f":"IF(V22=\"\",\"\",VLOOKUP(U22,$C$8:$M$106,11,FALSE))","v":90.2},{"$f":"IF(U22=\"\",\"\",VLOOKUP(U22,$C$8:$N$106,12,FALSE))","v":95.6},{"$f":"SUM(V22:AC22)","v":375.5},{"$f":"IF(U22=\"\",\"\",VLOOKUP(U22,$C$8:$P$106,14,FALSE))","v":8}]
[16,null,{"$f":"IF(E23=\"\",\"\",VLOOKUP(E23,PRIJAVA!$B$35:$H$240,2,FALSE) & \" \" & VLOOKUP(E23,PRIJAVA!$B$35:$H$240,3,FALSE))","v":"REŽEK Primož"},{"$f":"IF(E23=\"\",\"\",VLOOKUP(E23,PRIJAVA!$B$35:$H$240,5,FALSE))","v":1978},16384,{"$f":"IF(E23=\"\",\"\",VLOOKUP(E23,PRIJAVA!$B$35:$H$240,7,FALSE))","v":"SD Lotrič Železniki"},null,null,null,null,86,84.9,90.3,86.3,{"$f":"SUM(G23:N23)","v":347.5},3,null,null,null,null,null,null,null,null,null,null,null,null,{"$f":"SUM(AC20:AC22)","v":281.10000000000002},{"$f":"SUM(AD20:AD22)","v":1125},{"$f":"SUM(AE20:AE22)","v":21}]
[17,null,{"$f":"IF(E24=\"\",\"\",VLOOKUP(E24,PRIJAVA!$B$35:$H$240,2,FALSE) & \" \" & VLOOKUP(E24,PRIJAVA!$B$35:$H$240,3,FALSE))","v":"REŽEK Luka"},{"$f":"IF(E24=\"\",\"\",VLOOKUP(E24,PRIJAVA!$B$35:$H$240,5,FALSE))","v":2007},16129,{"$f":"IF(E24=\"\",\"\",VLOOKUP(E24,PRIJAVA!$B$35:$H$240,7,FALSE))","v":"SD Lotrič Železniki"},null,null,null,null,86.6,93.2,89.2,92.3,{"$f":"SUM(G24:N24)","v":361.3},8]
[18,null,{"$f":"IF(E25=\"\",\"\",VLOOKUP(E25,PRIJAVA!$B$35:$H$240,2,FALSE) & \" \" & VLOOKUP(E25,PRIJAVA!$B$35:$H$240,3,FALSE))","v":"ŠOLAR Teja"},{"$f":"IF(E25=\"\",\"\",VLOOKUP(E25,PRIJAVA!$B$35:$H$240,5,FALSE))","v":2008},15649,{"$f":"IF(E25=\"\",\"\",VLOOKUP(E25,PRIJAVA!$B$35:$H$240,7,FALSE))","v":"SD Lotrič Železniki"},null,null,null,null,101,100.9,100.2,102,{"$f":"SUM(G25:N25)","v":404.1},24]
[19,null,{"$f":"IF(E26=\"\",\"\",VLOOKUP(E26,PRIJAVA!$B$35:$H$240,2,FALSE) & \" \" & VLOOKUP(E26,PRIJAVA!$B$35:$H$240,3,FALSE))","v":"FABJAN Boštjan"},null,10313,{"$f":"IF(E26=\"\",\"\",VLOOKUP(E26,PRIJAVA!$B$35:$H$240,7,FALSE))","v":"SD Kamnik"},null,null,null,null,101.6,101.1,100.3,99.2,{"$f":"SUM(G26:N26)","v":402.2},19,null,null,null,null,{"$f":"IF(T28=\"\",\"\",VLOOKUP(T28,PRIJAVA!$B$35:$H$240,7,FALSE))","v":"SD Škofja Loka"}]
[20,null,{"$f":"IF(E27=\"\",\"\",VLOOKUP(E27,PRIJAVA!$B$35:$H$240,2,FALSE) & \" \" & VLOOKUP(E27,PRIJAVA!$B$35:$H$240,3,FALSE))","v":""},{"$f":"IF(E27=\"\",\"\",VLOOKUP(E27,PRIJAVA!$B$35:$H$240,5,FALSE))","v":""},null,{"$f":"IF(E27=\"\",\"\",VLOOKUP(E27,PRIJAVA!$B$35:$H$240,7,FALSE))","v":""},null,null,null,null,null,null,null,null,{"$f":"SUM(G27:N27)","v":0},null,null,null,null,"BIB","Priimek in ime","1. ser","2. ser","3. ser","4. ser","1. ser","2. ser","3. ser","4. ser","skupno","nc*"]
[21,null,{"$f":"IF(E28=\"\",\"\",VLOOKUP(E28,PRIJAVA!$B$35:$H$240,2,FALSE) & \" \" & VLOOKUP(E28,PRIJAVA!$B$35:$H$240,3,FALSE))","v":""},{"$f":"IF(E28=\"\",\"\",VLOOKUP(E28,PRIJAVA!$B$35:$H$240,5,FALSE))","v":""},null,{"$f":"IF(E28=\"\",\"\",VLOOKUP(E28,PRIJAVA!$B$35:$H$240,7,FALSE))","v":""},null,null,null,null,null,null,null,null,{"$f":"SUM(G28:N28)","v":0},null,null,null,null,16229,{"$f":"IF(T28=\"\",\"\",VLOOKUP(T28,PRIJAVA!$B$35:$H$240,2,FALSE) & \" \" & VLOOKUP(T28,PRIJAVA!$B$35:$H$240,3,FALSE))","v":"GRAŠIČ Lovro"},{"$f":"IF(U28=\"\",\"\",VLOOKUP(U28,$C$8:$N$106,5,FALSE))","v":0},{"$f":"IF(U28=\"\",\"\",VLOOKUP(U28,$C$8:$N$106,6,FALSE))","v":0},{"$f":"IF(U28=\"\",\"\",VLOOKUP(U28,$C$8:$N$106,7,FALSE))","v":0},{"$f":"IF(U28=\"\",\"\",VLOOKUP(U28,$C$8:$N$106,8,FALSE))","v":0},{"$f":"IF(U28=\"\",\"\",VLOOKUP(U28,$C$8:$N$106,9,FALSE))","v":93.5},{"$f":"IF(U28=\"\",\"\",VLOOKUP(U28,$C$8:$L$106,10,FALSE))","v":93.8},{"$f":"IF(V28=\"\",\"\",VLOOKUP(U28,$C$8:$M$106,11,FALSE))","v":96.1},{"$f":"IF(U28=\"\",\"\",VLOOKUP(U28,$C$8:$N$106,12,FALSE))","v":97.8},{"$f":"SUM(V28:AC28)","v":381.2},{"$f":"IF(U28=\"\",\"\",VLOOKUP(U28,$C$8:$P$106,14,FALSE))","v":6}]
[22,null,{"$f":"IF(E29=\"\",\"\",VLOOKUP(E29,PRIJAVA!$B$35:$H$240,2,FALSE) & \" \" & VLOOKUP(E29,PRIJAVA!$B$35:$H$240,3,FALSE))","v":""},{"$f":"IF(E29=\"\",\"\",VLOOKUP(E29,PRIJAVA!$B$35:$H$240,5,FALSE))","v":""},null,{"$f":"IF(E29=\"\",\"\",VLOOKUP(E29,PRIJAVA!$B$35:$H$240,7,FALSE))","v":""},null,null,null,null,null,null,null,null,0,null,null,null,null,14600,{"$f":"IF(T29=\"\",\"\",VLOOKUP(T29,PRIJAVA!$B$35:$H$240,2,FALSE) & \" \" & VLOOKUP(T29,PRIJAVA!$B$35:$H$240,3,FALSE))","v":"GABER Luka"},{"$f":"IF(U29=\"\",\"\",VLOOKUP(U29,$C$8:$N$106,5,FALSE))","v":0},{"$f":"IF(U29=\"\",\"\",VLOOKUP(U29,$C$8:$N$106,6,FALSE))","v":0},{"$f":"IF(U29=\"\",\"\",VLOOKUP(U29,$C$8:$N$106,7,FALSE))","v":0},{"$f":"IF(U29=\"\",\"\",VLOOKUP(U29,$C$8:$N$106,8,FALSE))","v":0},{"$f":"IF(U29=\"\",\"\",VLOOKUP(U29,$C$8:$N$106,9,FALSE))","v":100.6},{"$f":"IF(U29=\"\",\"\",VLOOKUP(U29,$C$8:$L$106,10,FALSE))","v":99.4},{"$f":"IF(V29=\"\",\"\",VLOOKUP(U29,$C$8:$M$106,11,FALSE))","v":102.2},{"$f":"IF(U29=\"\",\"\",VLOOKUP(U29,$C$8:$N$106,12,FALSE))","v":99.8},{"$f":"SUM(V29:AC29)","v":402},{"$f":"IF(U29=\"\",\"\",VLOOKUP(U29,$C$8:$P$106,14,FALSE))","v":20}]
[23,null,{"$f":"IF(E30=\"\",\"\",VLOOKUP(E30,PRIJAVA!$B$35:$H$240,2,FALSE) & \" \" & VLOOKUP(E30,PRIJAVA!$B$35:$H$240,3,FALSE))","v":""},{"$f":"IF(E30=\"\",\"\",VLOOKUP(E30,PRIJAVA!$B$35:$H$240,5,FALSE))","v":""},null,{"$f":"IF(E30=\"\",\"\",VLOOKUP(E30,PRIJAVA!$B$35:$H$240,7,FALSE))","v":""},null,null,null,null,null,null,null,null,{"$f":"SUM(G30:N30)","v":0},null,null,null,null,14599,{"$f":"IF(T30=\"\",\"\",VLOOKUP(T30,PRIJAVA!$B$35:$H$240,2,FALSE) & \" \" & VLOOKUP(T30,PRIJAVA!$B$35:$H$240,3,FALSE))","v":"KOPRIVNIKAR Žiga"},{"$f":"IF(U30=\"\",\"\",VLOOKUP(U30,$C$8:$N$106,5,FALSE))","v":0},{"$f":"IF(U30=\"\",\"\",VLOOKUP(U30,$C$8:$N$106,6,FALSE))","v":0},{"$f":"IF(U30=\"\",\"\",VLOOKUP(U30,$C$8:$N$106,7,FALSE))","v":0},{"$f":"IF(U30=\"\",\"\",VLOOKUP(U30,$C$8:$N$106,8,FALSE))","v":0},{"$f":"IF(U30=\"\",\"\",VLOOKUP(U30,$C$8:$N$106,9,FALSE))","v":95.6},{"$f":"IF(U30=\"\",\"\",VLOOKUP(U30,$C$8:$L$106,10,FALSE))","v":86.3},{"$f":"IF(V30=\"\",\"\",VLOOKUP(U30,$C$8:$M$106,11,FALSE))","v":94.5},{"$f":"IF(U30=\"\",\"\",VLOOKUP(U30,$C$8:$N$106,12,FALSE))","v":95},{"$f":"SUM(V30:AC30)","v":371.4},{"$f":"IF(U30=\"\",\"\",VLOOKUP(U30,$C$8:$P$106,14,FALSE))","v":5}]
[24,null,{"$f":"IF(E31=\"\",\"\",VLOOKUP(E31,PRIJAVA!$B$35:$H$240,2,FALSE) & \" \" & VLOOKUP(E31,PRIJAVA!$B$35:$H$240,3,FALSE))","v":""},{"$f":"IF(E31=\"\",\"\",VLOOKUP(E31,PRIJAVA!$B$35:$H$240,5,FALSE))","v":""},null,{"$f":"IF(E31=\"\",\"\",VLOOKUP(E31,PRIJAVA!$B$35:$H$240,7,FALSE))","v":""},null,null,null,null,null,null,null,null,{"$f":"SUM(G31:N31)","v":0},null,null,null,null,null,null,null,null,null,null,null,null,null,{"$f":"SUM(AC28:AC30)","v":292.60000000000002},{"$f":"SUM(AD28:AD30)","v":1154.5999999999999},{"$f":"SUM(AE28:AE30)","v":31}]
[25,null,{"$f":"IF(E32=\"\",\"\",VLOOKUP(E32,PRIJAVA!$B$35:$H$240,2,FALSE) & \" \" & VLOOKUP(E32,PRIJAVA!$B$35:$H$240,3,FALSE))","v":""},{"$f":"IF(E32=\"\",\"\",VLOOKUP(E32,PRIJAVA!$B$35:$H$240,5,FALSE))","v":""},null,{"$f":"IF(E32=\"\",\"\",VLOOKUP(E32,PRIJAVA!$B$35:$H$240,7,FALSE))","v":""},null,null,null,null,null,null,null,null,0]
[26,null,{"$f":"IF(E33=\"\",\"\",VLOOKUP(E33,PRIJAVA!$B$35:$H$240,2,FALSE) & \" \" & VLOOKUP(E33,PRIJAVA!$B$35:$H$240,3,FALSE))","v":""},{"$f":"IF(E33=\"\",\"\",VLOOKUP(E33,PRIJAVA!$B$35:$H$240,5,FALSE))","v":""},null,{"$f":"IF(E33=\"\",\"\",VLOOKUP(E33,PRIJAVA!$B$35:$H$240,7,FALSE))","v":""},null,null,null,null,null,null,null,null,0]
[27,null,{"$f":"IF(E34=\"\",\"\",VLOOKUP(E34,PRIJAVA!$B$35:$H$240,2,FALSE) & \" \" & VLOOKUP(E34,PRIJAVA!$B$35:$H$240,3,FALSE))","v":""},{"$f":"IF(E34=\"\",\"\",VLOOKUP(E34,PRIJAVA!$B$35:$H$240,5,FALSE))","v":""},null,{"$f":"IF(E34=\"\",\"\",VLOOKUP(E34,PRIJAVA!$B$35:$H$240,7,FALSE))","v":""},null,null,null,null,null,null,null,null,0,null,null,null,null,null,{"$f":"IF(T36=\"\",\"\",VLOOKUP(T36,PRIJAVA!$B$35:$H$240,7,FALSE))","v":"SD Lotrič Železniki"}]
[28,null,{"$f":"IF(E35=\"\",\"\",VLOOKUP(E35,PRIJAVA!$B$35:$H$240,2,FALSE) & \" \" & VLOOKUP(E35,PRIJAVA!$B$35:$H$240,3,FALSE))","v":""},{"$f":"IF(E35=\"\",\"\",VLOOKUP(E35,PRIJAVA!$B$35:$H$240,5,FALSE))","v":""},null,{"$f":"IF(E35=\"\",\"\",VLOOKUP(E35,PRIJAVA!$B$35:$H$240,7,FALSE))","v":""},null,null,null,null,null,null,null,null,0,null,null,null,null,"BIB","Priimek in ime","1. ser","2. ser","3. ser","4. ser","1. ser","2. ser","3. ser","4. ser","skupno","nc*"]
[29,null,{"$f":"IF(E36=\"\",\"\",VLOOKUP(E36,PRIJAVA!$B$35:$H$240,2,FALSE) & \" \" & VLOOKUP(E36,PRIJAVA!$B$35:$H$240,3,FALSE))","v":""},{"$f":"IF(E36=\"\",\"\",VLOOKUP(E36,PRIJAVA!$B$35:$H$240,5,FALSE))","v":""},null,{"$f":"IF(E36=\"\",\"\",VLOOKUP(E36,PRIJAVA!$B$35:$H$240,7,FALSE))","v":""},null,null,null,null,null,null,null,null,0,null,null,null,null,15648,{"$f":"IF(T36=\"\",\"\",VLOOKUP(T36,PRIJAVA!$B$35:$H$240,2,FALSE) & \" \" & VLOOKUP(T36,PRIJAVA!$B$35:$H$240,3,FALSE))","v":"BENEDIČIČ Manca"},{"$f":"IF(U36=\"\",\"\",VLOOKUP(U36,$C$8:$N$106,5,FALSE))","v":0},{"$f":"IF(U36=\"\",\"\",VLOOKUP(U36,$C$8:$N$106,6,FALSE))","v":0},{"$f":"IF(U36=\"\",\"\",VLOOKUP(U36,$C$8:$N$106,7,FALSE))","v":0},{"$f":"IF(U36=\"\",\"\",VLOOKUP(U36,$C$8:$N$106,8,FALSE))","v":0},{"$f":"IF(U36=\"\",\"\",VLOOKUP(U36,$C$8:$N$106,9,FALSE))","v":99.2},{"$f":"IF(U36=\"\",\"\",VLOOKUP(U36,$C$8:$L$106,10,FALSE))","v":99.9},{"$f":"IF(V36=\"\",\"\",VLOOKUP(U36,$C$8:$M$106,11,FALSE))","v":97.2},{"$f":"IF(U36=\"\",\"\",VLOOKUP(U36,$C$8:$N$106,12,FALSE))","v":96.9},{"$f":"SUM(V36:AC36)","v":393.20000000000005},{"$f":"IF(U36=\"\",\"\",VLOOKUP(U36,$C$8:$P$106,14,FALSE))","v":10}]
[30,null,{"$f":"IF(E37=\"\",\"\",VLOOKUP(E37,PRIJAVA!$B$35:$H$240,2,FALSE) & \" \" & VLOOKUP(E37,PRIJAVA!$B$35:$H$240,3,FALSE))","v":""},{"$f":"IF(E37=\"\",\"\",VLOOKUP(E37,PRIJAVA!$B$35:$H$240,5,FALSE))","v":""},null,{"$f":"IF(E37=\"\",\"\",VLOOKUP(E37,PRIJAVA!$B$35:$H$240,7,FALSE))","v":""},null,null,null,null,null,null,null,null,0,null,null,null,null,14547,{"$f":"IF(T37=\"\",\"\",VLOOKUP(T37,PRIJAVA!$B$35:$H$240,2,FALSE) & \" \" & VLOOKUP(T37,PRIJAVA!$B$35:$H$240,3,FALSE))","v":"BRATINA Jakob"},{"$f":"IF(U37=\"\",\"\",VLOOKUP(U37,$C$8:$N$106,5,FALSE))","v":0},{"$f":"IF(U37=\"\",\"\",VLOOKUP(U37,$C$8:$N$106,6,FALSE))","v":0},{"$f":"IF(U37=\"\",\"\",VLOOKUP(U37,$C$8:$N$106,7,FALSE))","v":0},{"$f":"IF(U37=\"\",\"\",VLOOKUP(U37,$C$8:$N$106,8,FALSE))","v":0},{"$f":"IF(U37=\"\",\"\",VLOOKUP(U37,$C$8:$N$106,9,FALSE))","v":95.2},{"$f":"IF(U37=\"\",\"\",VLOOKUP(U37,$C$8:$L$106,10,FALSE))","v":97.2},{"$f":"IF(V37=\"\",\"\",VLOOKUP(U37,$C$8:$M$106,11,FALSE))","v":92},{"$f":"IF(U37=\"\",\"\",VLOOKUP(U37,$C$8:$N$106,12,FALSE))","v":91.5},{"$f":"SUM(V37:AC37)","v":375.9},{"$f":"IF(U37=\"\",\"\",VLOOKUP(U37,$C$8:$P$106,14,FALSE))","v":6}]
[31,null,{"$f":"IF(E38=\"\",\"\",VLOOKUP(E38,PRIJAVA!$B$35:$H$240,2,FALSE) & \" \" & VLOOKUP(E38,PRIJAVA!$B$35:$H$240,3,FALSE))","v":""},{"$f":"IF(E38=\"\",\"\",VLOOKUP(E38,PRIJAVA!$B$35:$H$240,5,FALSE))","v":""},null,{"$f":"IF(E38=\"\",\"\",VLOOKUP(E38,PRIJAVA!$B$35:$H$240,7,FALSE))","v":""},null,null,null,null,null,null,null,null,0,null,null,null,null,15649,{"$f":"IF(T38=\"\",\"\",VLOOKUP(T38,PRIJAVA!$B$35:$H$240,2,FALSE) & \" \" & VLOOKUP(T38,PRIJAVA!$B$35:$H$240,3,FALSE))","v":"ŠOLAR Teja"},{"$f":"IF(U38=\"\",\"\",VLOOKUP(U38,$C$8:$N$106,5,FALSE))","v":0},{"$f":"IF(U38=\"\",\"\",VLOOKUP(U38,$C$8:$N$106,6,FALSE))","v":0},{"$f":"IF(U38=\"\",\"\",VLOOKUP(U38,$C$8:$N$106,7,FALSE))","v":0},{"$f":"IF(U38=\"\",\"\",VLOOKUP(U38,$C$8:$N$106,8,FALSE))","v":0},{"$f":"IF(U38=\"\",\"\",VLOOKUP(U38,$C$8:$N$106,9,FALSE))","v":101},{"$f":"IF(U38=\"\",\"\",VLOOKUP(U38,$C$8:$L$106,10,FALSE))","v":100.9},{"$f":"IF(V38=\"\",\"\",VLOOKUP(U38,$C$8:$M$106,11,FALSE))","v":100.2},{"$f":"IF(U38=\"\",\"\",VLOOKUP(U38,$C$8:$N$106,12,FALSE))","v":102},{"$f":"SUM(V38:AC38)","v":404.1},{"$f":"IF(U38=\"\",\"\",VLOOKUP(U38,$C$8:$P$106,14,FALSE))","v":24}]
[32,null,{"$f":"IF(E39=\"\",\"\",VLOOKUP(E39,PRIJAVA!$B$35:$H$240,2,FALSE) & \" \" & VLOOKUP(E39,PRIJAVA!$B$35:$H$240,3,FALSE))","v":""},{"$f":"IF(E39=\"\",\"\",VLOOKUP(E39,PRIJAVA!$B$35:$H$240,5,FALSE))","v":""},null,{"$f":"IF(E39=\"\",\"\",VLOOKUP(E39,PRIJAVA!$B$35:$H$240,7,FALSE))","v":""},null,null,null,null,null,null,null,null,0,null,null,null,null,null,null,null,null,null,null,null,null,null,{"$f":"SUM(AC36:AC38)","v":290.39999999999998},{"$f":"SUM(AD36:AD38)","v":1173.2},{"$f":"SUM(AE36:AE38)","v":40}]
[33,null,{"$f":"IF(E40=\"\",\"\",VLOOKUP(E40,PRIJAVA!$B$35:$H$240,2,FALSE) & \" \" & VLOOKUP(E40,PRIJAVA!$B$35:$H$240,3,FALSE))","v":""},{"$f":"IF(E40=\"\",\"\",VLOOKUP(E40,PRIJAVA!$B$35:$H$240,5,FALSE))","v":""},null,{"$f":"IF(E40=\"\",\"\",VLOOKUP(E40,PRIJAVA!$B$35:$H$240,7,FALSE))","v":""},null,null,null,null,null,null,null,null,0]
[34,null,{"$f":"IF(E41=\"\",\"\",VLOOKUP(E41,PRIJAVA!$B$35:$H$240,2,FALSE) & \" \" & VLOOKUP(E41,PRIJAVA!$B$35:$H$240,3,FALSE))","v":""},{"$f":"IF(E41=\"\",\"\",VLOOKUP(E41,PRIJAVA!$B$35:$H$240,5,FALSE))","v":""},null,{"$f":"IF(E41=\"\",\"\",VLOOKUP(E41,PRIJAVA!$B$35:$H$240,7,FALSE))","v":""},null,null,null,null,null,null,null,null,0,null,null,null,null,null,{"$f":"IF(T43=\"\",\"\",VLOOKUP(T43,PRIJAVA!$B$35:$H$240,7,FALSE))","v":""}]
[35,null,{"$f":"IF(E42=\"\",\"\",VLOOKUP(E42,PRIJAVA!$B$35:$H$240,2,FALSE) & \" \" & VLOOKUP(E42,PRIJAVA!$B$35:$H$240,3,FALSE))","v":""},{"$f":"IF(E42=\"\",\"\",VLOOKUP(E42,PRIJAVA!$B$35:$H$240,5,FALSE))","v":""},null,{"$f":"IF(E42=\"\",\"\",VLOOKUP(E42,PRIJAVA!$B$35:$H$240,7,FALSE))","v":""},null,null,null,null,null,null,null,null,0,null,null,null,null,"BIB","Priimek in ime","1. ser","2. ser","3. ser","4. ser","1. ser","2. ser","3. ser","4. ser","skupno","nc*"]
[36,null,{"$f":"IF(E43=\"\",\"\",VLOOKUP(E43,PRIJAVA!$B$35:$H$240,2,FALSE) & \" \" & VLOOKUP(E43,PRIJAVA!$B$35:$H$240,3,FALSE))","v":""},{"$f":"IF(E43=\"\",\"\",VLOOKUP(E43,PRIJAVA!$B$35:$H$240,5,FALSE))","v":""},null,{"$f":"IF(E43=\"\",\"\",VLOOKUP(E43,PRIJAVA!$B$35:$H$240,7,FALSE))","v":""},null,null,null,null,null,null,null,null,0,null,null,null,null,null,{"$f":"IF(T43=\"\",\"\",VLOOKUP(T43,PRIJAVA!$B$35:$H$240,2,FALSE) & \" \" & VLOOKUP(T43,PRIJAVA!$B$35:$H$240,3,FALSE))","v":""},{"$f":"IF(U43=\"\",\"\",VLOOKUP(U43,$C$8:$N$106,5,FALSE))","v":""},{"$f":"IF(U43=\"\",\"\",VLOOKUP(U43,$C$8:$N$106,6,FALSE))","v":""},{"$f":"IF(U43=\"\",\"\",VLOOKUP(U43,$C$8:$N$106,7,FALSE))","v":""},{"$f":"IF(U43=\"\",\"\",VLOOKUP(U43,$C$8:$N$106,8,FALSE))","v":""},{"$f":"IF(U43=\"\",\"\",VLOOKUP(U43,$C$8:$N$106,9,FALSE))","v":""},{"$f":"IF(U43=\"\",\"\",VLOOKUP(U43,$C$8:$L$106,10,FALSE))","v":""},{"$f":"IF(V43=\"\",\"\",VLOOKUP(U43,$C$8:$M$106,11,FALSE))","v":""},{"$f":"IF(U43=\"\",\"\",VLOOKUP(U43,$C$8:$N$106,12,FALSE))","v":""},{"$f":"SUM(V43:AC43)","v":0},{"$f":"IF(U43=\"\",\"\",VLOOKUP(U43,$C$8:$P$106,14,FALSE))","v":""}]
[37,null,{"$f":"IF(E44=\"\",\"\",VLOOKUP(E44,PRIJAVA!$B$35:$H$240,2,FALSE) & \" \" & VLOOKUP(E44,PRIJAVA!$B$35:$H$240,3,FALSE))","v":""},{"$f":"IF(E44=\"\",\"\",VLOOKUP(E44,PRIJAVA!$B$35:$H$240,5,FALSE))","v":""},null,{"$f":"IF(E44=\"\",\"\",VLOOKUP(E44,PRIJAVA!$B$35:$H$240,7,FALSE))","v":""},null,null,null,null,null,null,null,null,0,null,null,null,null,null,{"$f":"IF(T44=\"\",\"\",VLOOKUP(T44,PRIJAVA!$B$35:$H$240,2,FALSE) & \" \" & VLOOKUP(T44,PRIJAVA!$B$35:$H$240,3,FALSE))","v":""},{"$f":"IF(U44=\"\",\"\",VLOOKUP(U44,$C$8:$N$106,5,FALSE))","v":""},{"$f":"IF(U44=\"\",\"\",VLOOKUP(U44,$C$8:$N$106,6,FALSE))","v":""},{"$f":"IF(U44=\"\",\"\",VLOOKUP(U44,$C$8:$N$106,7,FALSE))","v":""},{"$f":"IF(U44=\"\",\"\",VLOOKUP(U44,$C$8:$N$106,8,FALSE))","v":""},{"$f":"IF(U44=\"\",\"\",VLOOKUP(U44,$C$8:$N$106,9,FALSE))","v":""},{"$f":"IF(U44=\"\",\"\",VLOOKUP(U44,$C$8:$L$106,10,FALSE))","v":""},{"$f":"IF(V44=\"\",\"\",VLOOKUP(U44,$C$8:$M$106,11,FALSE))","v":""},{"$f":"IF(U44=\"\",\"\",VLOOKUP(U44,$C$8:$N$106,12,FALSE))","v":""},{"$f":"SUM(V44:AC44)","v":0},{"$f":"IF(U44=\"\",\"\",VLOOKUP(U44,$C$8:$P$106,14,FALSE))","v":""}]
[38,null,{"$f":"IF(E45=\"\",\"\",VLOOKUP(E45,PRIJAVA!$B$35:$H$240,2,FALSE) & \" \" & VLOOKUP(E45,PRIJAVA!$B$35:$H$240,3,FALSE))","v":""},{"$f":"IF(E45=\"\",\"\",VLOOKUP(E45,PRIJAVA!$B$35:$H$240,5,FALSE))","v":""},null,{"$f":"IF(E45=\"\",\"\",VLOOKUP(E45,PRIJAVA!$B$35:$H$240,7,FALSE))","v":""},null,null,null,null,null,null,null,null,0,null,null,null,null,null,{"$f":"IF(T45=\"\",\"\",VLOOKUP(T45,PRIJAVA!$B$35:$H$240,2,FALSE) & \" \" & VLOOKUP(T45,PRIJAVA!$B$35:$H$240,3,FALSE))","v":""},{"$f":"IF(U45=\"\",\"\",VLOOKUP(U45,$C$8:$N$106,5,FALSE))","v":""},{"$f":"IF(U45=\"\",\"\",VLOOKUP(U45,$C$8:$N$106,6,FALSE))","v":""},{"$f":"IF(U45=\"\",\"\",VLOOKUP(U45,$C$8:$N$106,7,FALSE))","v":""},{"$f":"IF(U45=\"\",\"\",VLOOKUP(U45,$C$8:$N$106,8,FALSE))","v":""},{"$f":"IF(U45=\"\",\"\",VLOOKUP(U45,$C$8:$N$106,9,FALSE))","v":""},{"$f":"IF(U45=\"\",\"\",VLOOKUP(U45,$C$8:$L$106,10,FALSE))","v":""},{"$f":"IF(V45=\"\",\"\",VLOOKUP(U45,$C$8:$M$106,11,FALSE))","v":""},{"$f":"IF(U45=\"\",\"\",VLOOKUP(U45,$C$8:$N$106,12,FALSE))","v":""},{"$f":"SUM(V45:AC45)","v":0},{"$f":"IF(U45=\"\",\"\",VLOOKUP(U45,$C$8:$P$106,14,FALSE))","v":""}]
[39,null,{"$f":"IF(E46=\"\",\"\",VLOOKUP(E46,PRIJAVA!$B$35:$H$240,2,FALSE) & \" \" & VLOOKUP(E46,PRIJAVA!$B$35:$H$240,3,FALSE))","v":""},{"$f":"IF(E46=\"\",\"\",VLOOKUP(E46,PRIJAVA!$B$35:$H$240,5,FALSE))","v":""},null,{"$f":"IF(E46=\"\",\"\",VLOOKUP(E46,PRIJAVA!$B$35:$H$240,7,FALSE))","v":""},null,null,null,null,null,null,null,null,0,null,null,null,null,null,null,null,null,null,null,null,null,null,{"$f":"SUM(AC43:AC45)","v":0},{"$f":"SUM(AD43:AD45)","v":0},{"$f":"SUM(AE43:AE45)","v":0}]
[40,null,{"$f":"IF(E47=\"\",\"\",VLOOKUP(E47,PRIJAVA!$B$35:$H$240,2,FALSE) & \" \" & VLOOKUP(E47,PRIJAVA!$B$35:$H$240,3,FALSE))","v":""},{"$f":"IF(E47=\"\",\"\",VLOOKUP(E47,PRIJAVA!$B$35:$H$240,5,FALSE))","v":""},null,{"$f":"IF(E47=\"\",\"\",VLOOKUP(E47,PRIJAVA!$B$35:$H$240,7,FALSE))","v":""},null,null,null,null,null,null,null,null,0]
[41,null,{"$f":"IF(E48=\"\",\"\",VLOOKUP(E48,PRIJAVA!$B$35:$H$240,2,FALSE) & \" \" & VLOOKUP(E48,PRIJAVA!$B$35:$H$240,3,FALSE))","v":""},{"$f":"IF(E48=\"\",\"\",VLOOKUP(E48,PRIJAVA!$B$35:$H$240,5,FALSE))","v":""},null,{"$f":"IF(E48=\"\",\"\",VLOOKUP(E48,PRIJAVA!$B$35:$H$240,7,FALSE))","v":""},null,null,null,null,null,null,null,null,0]
[42,null,{"$f":"IF(E49=\"\",\"\",VLOOKUP(E49,PRIJAVA!$B$35:$H$240,2,FALSE) & \" \" & VLOOKUP(E49,PRIJAVA!$B$35:$H$240,3,FALSE))","v":""},{"$f":"IF(E49=\"\",\"\",VLOOKUP(E49,PRIJAVA!$B$35:$H$240,5,FALSE))","v":""},null,{"$f":"IF(E49=\"\",\"\",VLOOKUP(E49,PRIJAVA!$B$35:$H$240,7,FALSE))","v":""},null,null,null,null,null,null,null,null,0]
[43,null,{"$f":"IF(E50=\"\",\"\",VLOOKUP(E50,PRIJAVA!$B$35:$H$240,2,FALSE) & \" \" & VLOOKUP(E50,PRIJAVA!$B$35:$H$240,3,FALSE))","v":""},{"$f":"IF(E50=\"\",\"\",VLOOKUP(E50,PRIJAVA!$B$35:$H$240,5,FALSE))","v":""},null,{"$f":"IF(E50=\"\",\"\",VLOOKUP(E50,PRIJAVA!$B$35:$H$240,7,FALSE))","v":""},null,null,null,null,null,null,null,null,0]
[44,null,{"$f":"IF(E51=\"\",\"\",VLOOKUP(E51,PRIJAVA!$B$35:$H$240,2,FALSE) & \" \" & VLOOKUP(E51,PRIJAVA!$B$35:$H$240,3,FALSE))","v":""},{"$f":"IF(E51=\"\",\"\",VLOOKUP(E51,PRIJAVA!$B$35:$H$240,5,FALSE))","v":""},null,{"$f":"IF(E51=\"\",\"\",VLOOKUP(E51,PRIJAVA!$B$35:$H$240,7,FALSE))","v":""},null,null,null,null,null,null,null,null,0]
[45,null,{"$f":"IF(E52=\"\",\"\",VLOOKUP(E52,PRIJAVA!$B$35:$H$240,2,FALSE) & \" \" & VLOOKUP(E52,PRIJAVA!$B$35:$H$240,3,FALSE))","v":""},{"$f":"IF(E52=\"\",\"\",VLOOKUP(E52,PRIJAVA!$B$35:$H$240,5,FALSE))","v":""},null,{"$f":"IF(E52=\"\",\"\",VLOOKUP(E52,PRIJAVA!$B$35:$H$240,7,FALSE))","v":""},null,null,null,null,null,null,null,null,0]
[46,null,{"$f":"IF(E53=\"\",\"\",VLOOKUP(E53,PRIJAVA!$B$35:$H$240,2,FALSE) & \" \" & VLOOKUP(E53,PRIJAVA!$B$35:$H$240,3,FALSE))","v":""},{"$f":"IF(E53=\"\",\"\",VLOOKUP(E53,PRIJAVA!$B$35:$H$240,5,FALSE))","v":""},null,{"$f":"IF(E53=\"\",\"\",VLOOKUP(E53,PRIJAVA!$B$35:$H$240,7,FALSE))","v":""},null,null,null,null,null,null,null,null,0]
[47,null,{"$f":"IF(E54=\"\",\"\",VLOOKUP(E54,PRIJAVA!$B$35:$H$240,2,FALSE) & \" \" & VLOOKUP(E54,PRIJAVA!$B$35:$H$240,3,FALSE))","v":""},{"$f":"IF(E54=\"\",\"\",VLOOKUP(E54,PRIJAVA!$B$35:$H$240,5,FALSE))","v":""},null,{"$f":"IF(E54=\"\",\"\",VLOOKUP(E54,PRIJAVA!$B$35:$H$240,7,FALSE))","v":""},null,null,null,null,null,null,null,null,0]
[48,null,{"$f":"IF(E55=\"\",\"\",VLOOKUP(E55,PRIJAVA!$B$35:$H$240,2,FALSE) & \" \" & VLOOKUP(E55,PRIJAVA!$B$35:$H$240,3,FALSE))","v":""},{"$f":"IF(E55=\"\",\"\",VLOOKUP(E55,PRIJAVA!$B$35:$H$240,5,FALSE))","v":""},null,{"$f":"IF(E55=\"\",\"\",VLOOKUP(E55,PRIJAVA!$B$35:$H$240,7,FALSE))","v":""},null,null,null,null,null,null,null,null,0]
[49,null,{"$f":"IF(E56=\"\",\"\",VLOOKUP(E56,PRIJAVA!$B$35:$H$240,2,FALSE) & \" \" & VLOOKUP(E56,PRIJAVA!$B$35:$H$240,3,FALSE))","v":""},{"$f":"IF(E56=\"\",\"\",VLOOKUP(E56,PRIJAVA!$B$35:$H$240,5,FALSE))","v":""},null,{"$f":"IF(E56=\"\",\"\",VLOOKUP(E56,PRIJAVA!$B$35:$H$240,7,FALSE))","v":""},null,null,null,null,null,null,null,null,0]
[50,null,{"$f":"IF(E57=\"\",\"\",VLOOKUP(E57,PRIJAVA!$B$35:$H$240,2,FALSE) & \" \" & VLOOKUP(E57,PRIJAVA!$B$35:$H$240,3,FALSE))","v":""},{"$f":"IF(E57=\"\",\"\",VLOOKUP(E57,PRIJAVA!$B$35:$H$240,5,FALSE))","v":""},null,{"$f":"IF(E57=\"\",\"\",VLOOKUP(E57,PRIJAVA!$B$35:$H$240,7,FALSE))","v":""},null,null,null,null,null,null,null,null,0]
[51,null,{"$f":"IF(E58=\"\",\"\",VLOOKUP(E58,PRIJAVA!$B$35:$H$240,2,FALSE) & \" \" & VLOOKUP(E58,PRIJAVA!$B$35:$H$240,3,FALSE))","v":""},{"$f":"IF(E58=\"\",\"\",VLOOKUP(E58,PRIJAVA!$B$35:$H$240,5,FALSE))","v":""},null,{"$f":"IF(E58=\"\",\"\",VLOOKUP(E58,PRIJAVA!$B$35:$H$240,7,FALSE))","v":""},null,null,null,null,null,null,null,null,0]
[52,null,{"$f":"IF(E59=\"\",\"\",VLOOKUP(E59,PRIJAVA!$B$35:$H$240,2,FALSE) & \" \" & VLOOKUP(E59,PRIJAVA!$B$35:$H$240,3,FALSE))","v":""},{"$f":"IF(E59=\"\",\"\",VLOOKUP(E59,PRIJAVA!$B$35:$H$240,5,FALSE))","v":""},null,{"$f":"IF(E59=\"\",\"\",VLOOKUP(E59,PRIJAVA!$B$35:$H$240,7,FALSE))","v":""},null,null,null,null,null,null,null,null,0]
[53,null,{"$f":"IF(E60=\"\",\"\",VLOOKUP(E60,PRIJAVA!$B$35:$H$240,2,FALSE) & \" \" & VLOOKUP(E60,PRIJAVA!$B$35:$H$240,3,FALSE))","v":""},{"$f":"IF(E60=\"\",\"\",VLOOKUP(E60,PRIJAVA!$B$35:$H$240,5,FALSE))","v":""},null,{"$f":"IF(E60=\"\",\"\",VLOOKUP(E60,PRIJAVA!$B$35:$H$240,7,FALSE))","v":""},null,null,null,null,null,null,null,null,0]
[54,null,{"$f":"IF(E61=\"\",\"\",VLOOKUP(E61,PRIJAVA!$B$35:$H$240,2,FALSE) & \" \" & VLOOKUP(E61,PRIJAVA!$B$35:$H$240,3,FALSE))","v":""},{"$f":"IF(E61=\"\",\"\",VLOOKUP(E61,PRIJAVA!$B$35:$H$240,5,FALSE))","v":""},null,{"$f":"IF(E61=\"\",\"\",VLOOKUP(E61,PRIJAVA!$B$35:$H$240,7,FALSE))","v":""},null,null,null,null,null,null,null,null,0]
[55,null,{"$f":"IF(E62=\"\",\"\",VLOOKUP(E62,PRIJAVA!$B$35:$H$240,2,FALSE) & \" \" & VLOOKUP(E62,PRIJAVA!$B$35:$H$240,3,FALSE))","v":""},{"$f":"IF(E62=\"\",\"\",VLOOKUP(E62,PRIJAVA!$B$35:$H$240,5,FALSE))","v":""},null,{"$f":"IF(E62=\"\",\"\",VLOOKUP(E62,PRIJAVA!$B$35:$H$240,7,FALSE))","v":""},null,null,null,null,null,null,null,null,0]
[56,null,{"$f":"IF(E63=\"\",\"\",VLOOKUP(E63,PRIJAVA!$B$35:$H$240,2,FALSE) & \" \" & VLOOKUP(E63,PRIJAVA!$B$35:$H$240,3,FALSE))","v":""},{"$f":"IF(E63=\"\",\"\",VLOOKUP(E63,PRIJAVA!$B$35:$H$240,5,FALSE))","v":""},null,{"$f":"IF(E63=\"\",\"\",VLOOKUP(E63,PRIJAVA!$B$35:$H$240,7,FALSE))","v":""},null,null,null,null,null,null,null,null,0]
[57,null,{"$f":"IF(E64=\"\",\"\",VLOOKUP(E64,PRIJAVA!$B$35:$H$240,2,FALSE) & \" \" & VLOOKUP(E64,PRIJAVA!$B$35:$H$240,3,FALSE))","v":""},{"$f":"IF(E64=\"\",\"\",VLOOKUP(E64,PRIJAVA!$B$35:$H$240,5,FALSE))","v":""},null,{"$f":"IF(E64=\"\",\"\",VLOOKUP(E64,PRIJAVA!$B$35:$H$240,7,FALSE))","v":""},null,null,null,null,null,null,null,null,0]
[58,null,{"$f":"IF(E65=\"\",\"\",VLOOKUP(E65,PRIJAVA!$B$35:$H$240,2,FALSE) & \" \" & VLOOKUP(E65,PRIJAVA!$B$35:$H$240,3,FALSE))","v":""},{"$f":"IF(E65=\"\",\"\",VLOOKUP(E65,PRIJAVA!$B$35:$H$240,5,FALSE))","v":""},null,{"$f":"IF(E65=\"\",\"\",VLOOKUP(E65,PRIJAVA!$B$35:$H$240,7,FALSE))","v":""},null,null,null,null,null,null,null,null,0]
[59,null,{"$f":"IF(E66=\"\",\"\",VLOOKUP(E66,PRIJAVA!$B$35:$H$240,2,FALSE) & \" \" & VLOOKUP(E66,PRIJAVA!$B$35:$H$240,3,FALSE))","v":""},{"$f":"IF(E66=\"\",\"\",VLOOKUP(E66,PRIJAVA!$B$35:$H$240,5,FALSE))","v":""},null,{"$f":"IF(E66=\"\",\"\",VLOOKUP(E66,PRIJAVA!$B$35:$H$240,7,FALSE))","v":""},null,null,null,null,null,null,null,null,0]
[60,null,{"$f":"IF(E67=\"\",\"\",VLOOKUP(E67,PRIJAVA!$B$35:$H$240,2,FALSE) & \" \" & VLOOKUP(E67,PRIJAVA!$B$35:$H$240,3,FALSE))","v":""},{"$f":"IF(E67=\"\",\"\",VLOOKUP(E67,PRIJAVA!$B$35:$H$240,5,FALSE))","v":""},null,{"$f":"IF(E67=\"\",\"\",VLOOKUP(E67,PRIJAVA!$B$35:$H$240,7,FALSE))","v":""},null,null,null,null,null,null,null,null,0]
[61,null,{"$f":"IF(E68=\"\",\"\",VLOOKUP(E68,PRIJAVA!$B$35:$H$240,2,FALSE) & \" \" & VLOOKUP(E68,PRIJAVA!$B$35:$H$240,3,FALSE))","v":""},{"$f":"IF(E68=\"\",\"\",VLOOKUP(E68,PRIJAVA!$B$35:$H$240,5,FALSE))","v":""},null,{"$f":"IF(E68=\"\",\"\",VLOOKUP(E68,PRIJAVA!$B$35:$H$240,7,FALSE))","v":""},null,null,null,null,null,null,null,null,0]
[62,null,{"$f":"IF(E69=\"\",\"\",VLOOKUP(E69,PRIJAVA!$B$35:$H$240,2,FALSE) & \" \" & VLOOKUP(E69,PRIJAVA!$B$35:$H$240,3,FALSE))","v":""},{"$f":"IF(E69=\"\",\"\",VLOOKUP(E69,PRIJAVA!$B$35:$H$240,5,FALSE))","v":""},null,{"$f":"IF(E69=\"\",\"\",VLOOKUP(E69,PRIJAVA!$B$35:$H$240,7,FALSE))","v":""},null,null,null,null,null,null,null,null,0]
[63,null,{"$f":"IF(E70=\"\",\"\",VLOOKUP(E70,PRIJAVA!$B$35:$H$240,2,FALSE) & \" \" & VLOOKUP(E70,PRIJAVA!$B$35:$H$240,3,FALSE))","v":""},{"$f":"IF(E70=\"\",\"\",VLOOKUP(E70,PRIJAVA!$B$35:$H$240,5,FALSE))","v":""},null,{"$f":"IF(E70=\"\",\"\",VLOOKUP(E70,PRIJAVA!$B$35:$H$240,7,FALSE))","v":""},null,null,null,null,null,null,null,null,0]
[64,null,{"$f":"IF(E71=\"\",\"\",VLOOKUP(E71,PRIJAVA!$B$35:$H$240,2,FALSE) & \" \" & VLOOKUP(E71,PRIJAVA!$B$35:$H$240,3,FALSE))","v":""},{"$f":"IF(E71=\"\",\"\",VLOOKUP(E71,PRIJAVA!$B$35:$H$240,5,FALSE))","v":""},null,{"$f":"IF(E71=\"\",\"\",VLOOKUP(E71,PRIJAVA!$B$35:$H$240,7,FALSE))","v":""},null,null,null,null,null,null,null,null,0]
[65,null,{"$f":"IF(E72=\"\",\"\",VLOOKUP(E72,PRIJAVA!$B$35:$H$240,2,FALSE) & \" \" & VLOOKUP(E72,PRIJAVA!$B$35:$H$240,3,FALSE))","v":""},{"$f":"IF(E72=\"\",\"\",VLOOKUP(E72,PRIJAVA!$B$35:$H$240,5,FALSE))","v":""},null,{"$f":"IF(E72=\"\",\"\",VLOOKUP(E72,PRIJAVA!$B$35:$H$240,7,FALSE))","v":""},null,null,null,null,null,null,null,null,{"$f":"SUM(G72:N72)","v":0}]
[66,null,{"$f":"IF(E73=\"\",\"\",VLOOKUP(E73,PRIJAVA!$B$35:$H$240,2,FALSE) & \" \" & VLOOKUP(E73,PRIJAVA!$B$35:$H$240,3,FALSE))","v":""},{"$f":"IF(E73=\"\",\"\",VLOOKUP(E73,PRIJAVA!$B$35:$H$240,5,FALSE))","v":""},null,{"$f":"IF(E73=\"\",\"\",VLOOKUP(E73,PRIJAVA!$B$35:$H$240,7,FALSE))","v":""},null,null,null,null,null,null,null,null,0]
[67,null,{"$f":"IF(E74=\"\",\"\",VLOOKUP(E74,PRIJAVA!$B$35:$H$240,2,FALSE) & \" \" & VLOOKUP(E74,PRIJAVA!$B$35:$H$240,3,FALSE))","v":""},{"$f":"IF(E74=\"\",\"\",VLOOKUP(E74,PRIJAVA!$B$35:$H$240,5,FALSE))","v":""},null,{"$f":"IF(E74=\"\",\"\",VLOOKUP(E74,PRIJAVA!$B$35:$H$240,7,FALSE))","v":""},null,null,null,null,null,null,null,null,0]
[68,null,{"$f":"IF(E75=\"\",\"\",VLOOKUP(E75,PRIJAVA!$B$35:$H$240,2,FALSE) & \" \" & VLOOKUP(E75,PRIJAVA!$B$35:$H$240,3,FALSE))","v":""},{"$f":"IF(E75=\"\",\"\",VLOOKUP(E75,PRIJAVA!$B$35:$H$240,5,FALSE))","v":""},null,{"$f":"IF(E75=\"\",\"\",VLOOKUP(E75,PRIJAVA!$B$35:$H$240,7,FALSE))","v":""},null,null,null,null,null,null,null,null,0]
[69,null,{"$f":"IF(E76=\"\",\"\",VLOOKUP(E76,PRIJAVA!$B$35:$H$240,2,FALSE) & \" \" & VLOOKUP(E76,PRIJAVA!$B$35:$H$240,3,FALSE))","v":""},{"$f":"IF(E76=\"\",\"\",VLOOKUP(E76,PRIJAVA!$B$35:$H$240,5,FALSE))","v":""},null,{"$f":"IF(E76=\"\",\"\",VLOOKUP(E76,PRIJAVA!$B$35:$H$240,7,FALSE))","v":""},null,null,null,null,null,null,null,null,0]
[70,null,{"$f":"IF(E77=\"\",\"\",VLOOKUP(E77,PRIJAVA!$B$35:$H$240,2,FALSE) & \" \" & VLOOKUP(E77,PRIJAVA!$B$35:$H$240,3,FALSE))","v":""},{"$f":"IF(E77=\"\",\"\",VLOOKUP(E77,PRIJAVA!$B$35:$H$240,5,FALSE))","v":""},null,{"$f":"IF(E77=\"\",\"\",VLOOKUP(E77,PRIJAVA!$B$35:$H$240,7,FALSE))","v":""},null,null,null,null,null,null,null,null,0]
[71,null,{"$f":"IF(E78=\"\",\"\",VLOOKUP(E78,PRIJAVA!$B$35:$H$240,2,FALSE) & \" \" & VLOOKUP(E78,PRIJAVA!$B$35:$H$240,3,FALSE))","v":""},{"$f":"IF(E78=\"\",\"\",VLOOKUP(E78,PRIJAVA!$B$35:$H$240,5,FALSE))","v":""},null,{"$f":"IF(E78=\"\",\"\",VLOOKUP(E78,PRIJAVA!$B$35:$H$240,7,FALSE))","v":""},null,null,null,null,null,null,null,null,0]
[72,null,{"$f":"IF(E79=\"\",\"\",VLOOKUP(E79,PRIJAVA!$B$35:$H$240,2,FALSE) & \" \" & VLOOKUP(E79,PRIJAVA!$B$35:$H$240,3,FALSE))","v":""},{"$f":"IF(E79=\"\",\"\",VLOOKUP(E79,PRIJAVA!$B$35:$H$240,5,FALSE))","v":""},null,{"$f":"IF(E79=\"\",\"\",VLOOKUP(E79,PRIJAVA!$B$35:$H$240,7,FALSE))","v":""},null,null,null,null,null,null,null,null,0]
[73,null,{"$f":"IF(E80=\"\",\"\",VLOOKUP(E80,PRIJAVA!$B$35:$H$240,2,FALSE) & \" \" & VLOOKUP(E80,PRIJAVA!$B$35:$H$240,3,FALSE))","v":""},{"$f":"IF(E80=\"\",\"\",VLOOKUP(E80,PRIJAVA!$B$35:$H$240,5,FALSE))","v":""},null,{"$f":"IF(E80=\"\",\"\",VLOOKUP(E80,PRIJAVA!$B$35:$H$240,7,FALSE))","v":""},null,null,null,null,null,null,null,null,0]
[74,null,{"$f":"IF(E81=\"\",\"\",VLOOKUP(E81,PRIJAVA!$B$35:$H$240,2,FALSE) & \" \" & VLOOKUP(E81,PRIJAVA!$B$35:$H$240,3,FALSE))","v":""},{"$f":"IF(E81=\"\",\"\",VLOOKUP(E81,PRIJAVA!$B$35:$H$240,5,FALSE))","v":""},null,{"$f":"IF(E81=\"\",\"\",VLOOKUP(E81,PRIJAVA!$B$35:$H$240,7,FALSE))","v":""},null,null,null,null,null,null,null,null,0]
[75,null,{"$f":"IF(E82=\"\",\"\",VLOOKUP(E82,PRIJAVA!$B$35:$H$240,2,FALSE) & \" \" & VLOOKUP(E82,PRIJAVA!$B$35:$H$240,3,FALSE))","v":""},{"$f":"IF(E82=\"\",\"\",VLOOKUP(E82,PRIJAVA!$B$35:$H$240,5,FALSE))","v":""},null,{"$f":"IF(E82=\"\",\"\",VLOOKUP(E82,PRIJAVA!$B$35:$H$240,7,FALSE))","v":""},null,null,null,null,null,null,null,null,0]
[76,null,{"$f":"IF(E83=\"\",\"\",VLOOKUP(E83,PRIJAVA!$B$35:$H$240,2,FALSE) & \" \" & VLOOKUP(E83,PRIJAVA!$B$35:$H$240,3,FALSE))","v":""},{"$f":"IF(E83=\"\",\"\",VLOOKUP(E83,PRIJAVA!$B$35:$H$240,5,FALSE))","v":""},null,{"$f":"IF(E83=\"\",\"\",VLOOKUP(E83,PRIJAVA!$B$35:$H$240,7,FALSE))","v":""},null,null,null,null,null,null,null,null,0]
[77,null,{"$f":"IF(E84=\"\",\"\",VLOOKUP(E84,PRIJAVA!$B$35:$H$240,2,FALSE) & \" \" & VLOOKUP(E84,PRIJAVA!$B$35:$H$240,3,FALSE))","v":""},{"$f":"IF(E84=\"\",\"\",VLOOKUP(E84,PRIJAVA!$B$35:$H$240,5,FALSE))","v":""},null,{"$f":"IF(E84=\"\",\"\",VLOOKUP(E84,PRIJAVA!$B$35:$H$240,7,FALSE))","v":""},null,null,null,null,null,null,null,null,0]
[78,null,{"$f":"IF(E85=\"\",\"\",VLOOKUP(E85,PRIJAVA!$B$35:$H$240,2,FALSE) & \" \" & VLOOKUP(E85,PRIJAVA!$B$35:$H$240,3,FALSE))","v":""},{"$f":"IF(E85=\"\",\"\",VLOOKUP(E85,PRIJAVA!$B$35:$H$240,5,FALSE))","v":""},null,{"$f":"IF(E85=\"\",\"\",VLOOKUP(E85,PRIJAVA!$B$35:$H$240,7,FALSE))","v":""},null,null,null,null,null,null,null,null,0]
[79,null,{"$f":"IF(E86=\"\",\"\",VLOOKUP(E86,PRIJAVA!$B$35:$H$240,2,FALSE) & \" \" & VLOOKUP(E86,PRIJAVA!$B$35:$H$240,3,FALSE))","v":""},{"$f":"IF(E86=\"\",\"\",VLOOKUP(E86,PRIJAVA!$B$35:$H$240,5,FALSE))","v":""},null,{"$f":"IF(E86=\"\",\"\",VLOOKUP(E86,PRIJAVA!$B$35:$H$240,7,FALSE))","v":""},null,null,null,null,null,null,null,null,0]
[80,null,{"$f":"IF(E87=\"\",\"\",VLOOKUP(E87,PRIJAVA!$B$35:$H$240,2,FALSE) & \" \" & VLOOKUP(E87,PRIJAVA!$B$35:$H$240,3,FALSE))","v":""},{"$f":"IF(E87=\"\",\"\",VLOOKUP(E87,PRIJAVA!$B$35:$H$240,5,FALSE))","v":""},null,{"$f":"IF(E87=\"\",\"\",VLOOKUP(E87,PRIJAVA!$B$35:$H$240,7,FALSE))","v":""},null,null,null,null,null,null,null,null,0]
[81,null,{"$f":"IF(E88=\"\",\"\",VLOOKUP(E88,PRIJAVA!$B$35:$H$240,2,FALSE) & \" \" & VLOOKUP(E88,PRIJAVA!$B$35:$H$240,3,FALSE))","v":""},{"$f":"IF(E88=\"\",\"\",VLOOKUP(E88,PRIJAVA!$B$35:$H$240,5,FALSE))","v":""},null,{"$f":"IF(E88=\"\",\"\",VLOOKUP(E88,PRIJAVA!$B$35:$H$240,7,FALSE))","v":""},null,null,null,null,null,null,null,null,0]
[82,null,{"$f":"IF(E89=\"\",\"\",VLOOKUP(E89,PRIJAVA!$B$35:$H$240,2,FALSE) & \" \" & VLOOKUP(E89,PRIJAVA!$B$35:$H$240,3,FALSE))","v":""},{"$f":"IF(E89=\"\",\"\",VLOOKUP(E89,PRIJAVA!$B$35:$H$240,5,FALSE))","v":""},null,{"$f":"IF(E89=\"\",\"\",VLOOKUP(E89,PRIJAVA!$B$35:$H$240,7,FALSE))","v":""},null,null,null,null,null,null,null,null,0]
[83,null,{"$f":"IF(E90=\"\",\"\",VLOOKUP(E90,PRIJAVA!$B$35:$H$240,2,FALSE) & \" \" & VLOOKUP(E90,PRIJAVA!$B$35:$H$240,3,FALSE))","v":""},{"$f":"IF(E90=\"\",\"\",VLOOKUP(E90,PRIJAVA!$B$35:$H$240,5,FALSE))","v":""},null,{"$f":"IF(E90=\"\",\"\",VLOOKUP(E90,PRIJAVA!$B$35:$H$240,7,FALSE))","v":""},null,null,null,null,null,null,null,null,0]
[84,null,{"$f":"IF(E91=\"\",\"\",VLOOKUP(E91,PRIJAVA!$B$35:$H$240,2,FALSE) & \" \" & VLOOKUP(E91,PRIJAVA!$B$35:$H$240,3,FALSE))","v":""},{"$f":"IF(E91=\"\",\"\",VLOOKUP(E91,PRIJAVA!$B$35:$H$240,5,FALSE))","v":""},null,{"$f":"IF(E91=\"\",\"\",VLOOKUP(E91,PRIJAVA!$B$35:$H$240,7,FALSE))","v":""},null,null,null,null,null,null,null,null,0]
[85,null,{"$f":"IF(E92=\"\",\"\",VLOOKUP(E92,PRIJAVA!$B$35:$H$240,2,FALSE) & \" \" & VLOOKUP(E92,PRIJAVA!$B$35:$H$240,3,FALSE))","v":""},{"$f":"IF(E92=\"\",\"\",VLOOKUP(E92,PRIJAVA!$B$35:$H$240,5,FALSE))","v":""},null,{"$f":"IF(E92=\"\",\"\",VLOOKUP(E92,PRIJAVA!$B$35:$H$240,7,FALSE))","v":""},null,null,null,null,null,null,null,null,0]
[86,null,{"$f":"IF(E93=\"\",\"\",VLOOKUP(E93,PRIJAVA!$B$35:$H$240,2,FALSE) & \" \" & VLOOKUP(E93,PRIJAVA!$B$35:$H$240,3,FALSE))","v":""},{"$f":"IF(E93=\"\",\"\",VLOOKUP(E93,PRIJAVA!$B$35:$H$240,5,FALSE))","v":""},null,{"$f":"IF(E93=\"\",\"\",VLOOKUP(E93,PRIJAVA!$B$35:$H$240,7,FALSE))","v":""},null,null,null,null,null,null,null,null,0]
[87,null,{"$f":"IF(E94=\"\",\"\",VLOOKUP(E94,PRIJAVA!$B$35:$H$240,2,FALSE) & \" \" & VLOOKUP(E94,PRIJAVA!$B$35:$H$240,3,FALSE))","v":""},{"$f":"IF(E94=\"\",\"\",VLOOKUP(E94,PRIJAVA!$B$35:$H$240,5,FALSE))","v":""},null,{"$f":"IF(E94=\"\",\"\",VLOOKUP(E94,PRIJAVA!$B$35:$H$240,7,FALSE))","v":""},null,null,null,null,null,null,null,null,0]
[88,null,{"$f":"IF(E95=\"\",\"\",VLOOKUP(E95,PRIJAVA!$B$35:$H$240,2,FALSE) & \" \" & VLOOKUP(E95,PRIJAVA!$B$35:$H$240,3,FALSE))","v":""},{"$f":"IF(E95=\"\",\"\",VLOOKUP(E95,PRIJAVA!$B$35:$H$240,5,FALSE))","v":""},null,{"$f":"IF(E95=\"\",\"\",VLOOKUP(E95,PRIJAVA!$B$35:$H$240,7,FALSE))","v":""},null,null,null,null,null,null,null,null,0]
[89,null,{"$f":"IF(E96=\"\",\"\",VLOOKUP(E96,PRIJAVA!$B$35:$H$240,2,FALSE) & \" \" & VLOOKUP(E96,PRIJAVA!$B$35:$H$240,3,FALSE))","v":""},{"$f":"IF(E96=\"\",\"\",VLOOKUP(E96,PRIJAVA!$B$35:$H$240,5,FALSE))","v":""},null,{"$f":"IF(E96=\"\",\"\",VLOOKUP(E96,PRIJAVA!$B$35:$H$240,7,FALSE))","v":""},null,null,null,null,null,null,null,null,0]
[90,null,{"$f":"IF(E97=\"\",\"\",VLOOKUP(E97,PRIJAVA!$B$35:$H$240,2,FALSE) & \" \" & VLOOKUP(E97,PRIJAVA!$B$35:$H$240,3,FALSE))","v":""},{"$f":"IF(E97=\"\",\"\",VLOOKUP(E97,PRIJAVA!$B$35:$H$240,5,FALSE))","v":""},null,{"$f":"IF(E97=\"\",\"\",VLOOKUP(E97,PRIJAVA!$B$35:$H$240,7,FALSE))","v":""},null,null,null,null,null,null,null,null,0]
[91,null,{"$f":"IF(E98=\"\",\"\",VLOOKUP(E98,PRIJAVA!$B$35:$H$240,2,FALSE) & \" \" & VLOOKUP(E98,PRIJAVA!$B$35:$H$240,3,FALSE))","v":""},{"$f":"IF(E98=\"\",\"\",VLOOKUP(E98,PRIJAVA!$B$35:$H$240,5,FALSE))","v":""},null,{"$f":"IF(E98=\"\",\"\",VLOOKUP(E98,PRIJAVA!$B$35:$H$240,7,FALSE))","v":""},null,null,null,null,null,null,null,null,0]
[92,null,{"$f":"IF(E99=\"\",\"\",VLOOKUP(E99,PRIJAVA!$B$35:$H$240,2,FALSE) & \" \" & VLOOKUP(E99,PRIJAVA!$B$35:$H$240,3,FALSE))","v":""},{"$f":"IF(E99=\"\",\"\",VLOOKUP(E99,PRIJAVA!$B$35:$H$240,5,FALSE))","v":""},null,{"$f":"IF(E99=\"\",\"\",VLOOKUP(E99,PRIJAVA!$B$35:$H$240,7,FALSE))","v":""},null,null,null,null,null,null,null,null,0]
[93,null,{"$f":"IF(E100=\"\",\"\",VLOOKUP(E100,PRIJAVA!$B$35:$H$240,2,FALSE) & \" \" & VLOOKUP(E100,PRIJAVA!$B$35:$H$240,3,FALSE))","v":""},{"$f":"IF(E100=\"\",\"\",VLOOKUP(E100,PRIJAVA!$B$35:$H$240,5,FALSE))","v":""},null,{"$f":"IF(E100=\"\",\"\",VLOOKUP(E100,PRIJAVA!$B$35:$H$240,7,FALSE))","v":""},null,null,null,null,null,null,null,null,0]
[94,null,{"$f":"IF(E101=\"\",\"\",VLOOKUP(E101,PRIJAVA!$B$35:$H$240,2,FALSE) & \" \" & VLOOKUP(E101,PRIJAVA!$B$35:$H$240,3,FALSE))","v":""},{"$f":"IF(E101=\"\",\"\",VLOOKUP(E101,PRIJAVA!$B$35:$H$240,5,FALSE))","v":""},null,{"$f":"IF(E101=\"\",\"\",VLOOKUP(E101,PRIJAVA!$B$35:$H$240,7,FALSE))","v":""},null,null,null,null,null,null,null,null,0]
[95,null,{"$f":"IF(E102=\"\",\"\",VLOOKUP(E102,PRIJAVA!$B$35:$H$240,2,FALSE) & \" \" & VLOOKUP(E102,PRIJAVA!$B$35:$H$240,3,FALSE))","v":""},{"$f":"IF(E102=\"\",\"\",VLOOKUP(E102,PRIJAVA!$B$35:$H$240,5,FALSE))","v":""},null,{"$f":"IF(E102=\"\",\"\",VLOOKUP(E102,PRIJAVA!$B$35:$H$240,7,FALSE))","v":""},null,null,null,null,null,null,null,null,0]
[96,null,{"$f":"IF(E103=\"\",\"\",VLOOKUP(E103,PRIJAVA!$B$35:$H$240,2,FALSE) & \" \" & VLOOKUP(E103,PRIJAVA!$B$35:$H$240,3,FALSE))","v":""},{"$f":"IF(E103=\"\",\"\",VLOOKUP(E103,PRIJAVA!$B$35:$H$240,5,FALSE))","v":""},null,{"$f":"IF(E103=\"\",\"\",VLOOKUP(E103,PRIJAVA!$B$35:$H$240,7,FALSE))","v":""},null,null,null,null,null,null,null,null,0]

{"sheet":"sodniki","index":4,"n_rows":168,"n_cols":1,"rows_kept":168,"cut":false,"hidden":true,"merged":[]}
["Izberite iz seznama"]
["KOPINJA Jože ,  DS  , P02006"]
["SLANIČ Davorin ,  DS  , P01890"]
["MAKARI Igor ,  DS  , P02004"]
["CIGLAR Tomaž ,  RS  , P02130"]
["JERIČ Boštjan ,  RS  , P02131"]
["KELENC  Janez ,  MS  , B 8087"]
["KELENC Žan ,  DS  , P02003"]
["GOLOB Irena ,  MS  , B 8086"]
["GOLOB Enea ,  DS  , P02017"]
["ČUČKO Aljaž ,  RS  , P02102"]
["DRAŠKOVIČ Božidar ,  RS  , P02140"]
["MAUČEC  Jože ,  RS  , P01933"]
["MAUČEC Gregor ,  DS  , P01935"]
["BALAŠKO Štefan ,  DS  , P01931"]
["ŽALIK Avgust ,  RS  , P01932"]
["KOSI Mladen ,  DS  , P01962"]
["KRIŽANIČ Toni ,  DS  , P00034"]
["NAGY Robert ,  RS  , P02002"]
["ŠTAMAN Vasja ,  DS  , P01963"]
["VOGRINEC Alojz ,  DS  , P00035"]
["ŽNIDARIČ Nuša ,  RS  , P02079"]
["HABJANIČ Matjaž ,  RS  , P00045"]
["HORVAT Tadej ,  MS  , B 8085"]
["STANIČ Andrej ,  RS  , P00041"]
["VERNIK Darko ,  DS  , P00046"]
["VOČANEC Stiven ,  MS  , B 8083"]
["KARDOŠ Branko ,  RS  , P02068"]
["VERBANČIČ Denis ,  RS  , P00622"]
["ČERNI Mitja ,  DS  , P01860"]
["ČERNI Štefan ,  RS  , P01858"]
["ČERNI Jernej ,  RS  , P01861"]
["GRLEC Drago ,  RS  , P00287"]
["SLEPEC Boštjan ,  S  , "]
["CAR Franc ,  RS  , "]
["BENKOVIČ Tomaž ,  RS  , "]
["LUBEJ Anton ,  S  , P00062"]
["JAZBINŠEK Jernej ,  DS  , P00061"]
["VRABIČ Tomaž ,  DS  , P00065"]
["SREŠ Sonja ,  DS  , P01980"]
["GRIL Boštjan ,  RS  , P00063"]
["PODLESNIK Stanko ,  DS  , P00069"]
["TRUP Janez ,  MS  ,  B 2771"]
["VERNIK Milan ,  DS  , P00082"]
["STRNAD Adrijana ,  MS  , B 8090"]
["POTRČ Mojca ,  MS  , B 8088"]
["OSRAJNIK Janez ,  RS  , P02060"]
["SULJIČ Sabina ,  RS  , P02088"]
["VIDMAR Boštjan , RS  , P02062"]
["KOLAR Anton ,  RS  , P02063"]
["BERDNIK Andreja ,  RS  , P02064"]
["VIDMAR Karli ,  DS  , P02065"]
["BERLAK Janko ,  RS  , P00084"]
["PAVLIN Darko ,  DS  , P00053"]
["PŠAJD Ludvik ,  DS  , P00051"]
["CICMANOVIČ Zimet Ivo ,  S  , P02072"]
["GOJKOŠEK Žan ,  RS  , P02073"]
["ŠIRONIK Domen ,  RS  , P02074"]
["VUK Tilen ,  RS  , P02076"]
["MOHORKO Matevž ,  DS  , P00080"]
["KMETEC Gregor ,  DS  , P02008"]
["MOHORKO Uroš ,  DS  , P02009"]
["LESKOVAR Iztok ,  RS  , "]
["SIMIČ George ,  DS  , P01934"]
["KNEZ Beno ,  DS  , P00047"]
["JELEN Marko ,  DS  , P01836"]
["ARNUŠ Radivoj ,  S  , P02120"]
["FIJAUŽ Peter ,  RS  , P02121"]
["GOLOB Peter ml ,  DS  , P02011"]
["GOLOB Peter ,  MS  , A 5779"]
["MAJHENIČ  Anton Jože ,  MS  , A 3284"]
["STOŠIĆ Mile ,  DS  , P02012"]
["KOSTANJEVEC  Zlatko ,  DS  , P00055"]
["GÖNC Simeon ,  MS  , B 8084"]
["STRAKUŠEK Oto ,  MS  , A 5781"]
["STRAKUŠEK Martin ,  DS  , P00596"]
["STRAKUŠEK  Vesna ,  DS  , P00115"]
["SLANŠEK Bogdan ,  RS  , P02141"]
["OCVIRK Marjan ,  RS  , P02040"]
["MAROT Matic ,  RS  , P02041"]
["PRIVŠEK Cvetko ,  RS  , P02142"]
["HUDALES Martin ,  RS  , P01851"]
["MENCINGER Robert ,  DS  , P00120"]
["SLATINEK Viktor ,  RS  , P01835"]
["GORIŠEK Boris ,  RS  , P02043"]
["KALIN Marjan ,  RS  , P02044"]
["JENKO Peter ,  RS  , P02046"]
["TKALEC Peter ,  RS  , P02143"]
["ŠTERMAN Renato ,  MS  , B 5158"]
["FEVŽER Martin ,  MS  , B 8062"]
["STAJNKO Igor ,  MS  , B 8089"]
["ROŽIČ Branko ,  RS  , P00170"]
["ŠTIFTAR Jurij ,  DS  , P00171"]
["KOŠIR Aleš ,  DS  , P01871"]
["KUČIČ Krištof ,  DS  , P01977"]
["REPIČ Rožle ,  RS  , P01870"]
["ZORE Anže ,  DS  , P01867"]
["SERŠA Pavel ,  RS  , P02020"]
["ZORE Franc ,  RS  , P01968"]
["MARKELJ Vesna ,  RS  , P02081"]
["KOŠIR Timotej ,  RS  , P02083"]
["KOŠIR Branko ,  DS  , P00174"]
["MARKELJ Franci ,  RS  , P01909"]
["PRELEC Tomaž ,  DS  , P01887"]
["PRELEC Romana ,  DS  , P02023"]
["JEZERŠEK Pavel ,  RS  , P02144"]
["BERNOT Anže ,  S  , "]
["JAZBEC Damijan ,  DS  , P02104"]
["KLOPČIČ Nejc ,  RS  , P02105"]
["KONJEVIĆ Miloš ,  RS  , P02108"]
["JOHANSSON Stellan ,  RS  , P02109"]
["ADLEŠIČ Jernej ,  MS  , B 8081"]
["GORJUP  Andreja ,  MS  , A 5780"]
["KAPLAN Janez ,  RS  , P02037"]
["NOSE Matej ,  RS  , P02039"]
["KAPLAN Jože ,  S  , P02036"]
["LESAR Anton ,  DS  , P01964"]
["VIDMAR Samo Alain ,  RS  , P02053"]
["IVANC Rok ,  RS  , P02054"]
["BOŽIČ Matej ,  DS  , P01971"]
["JANEŽ Herman ,  DS  , P00073"]
["JURKOVIČ Mihael ,  DS  , P00083"]
["KOS Draga ,  DS  , P00066"]
["SLADIČ Polonca ,  DS  , P02159"]
["TEKAVČIČ Andraž ,  DS  , P00052"]
["MIKOLIČ Alojz ,  MS  ,  B 3285"]
["VALANT Elvira ,  MS  ,  A 4199"]
["BENČINA Sonja ,  RS  , P02090"]
["BEVK Branimir ,  RS  , P02091"]
["VIDMAR Stanko ,  RS  , P02092"]
["VALANT Igor ,  DS  , P00076"]
["VALANT Tilen ,  DS  , P00064"]
["MAJERLE Anton ,  MS  ,  B 3283"]
["VRHUNC Luka ,  RS  , P02098"]
["MAJERLE Miha ,  RS  , P02099"]
["KRIVEC Matic ,  RS  , P02101"]
["HROVAT Primož ,  RS  , P02100"]
["MUGERLE Alenka ,  DS  , P02027"]
["LUNDER Roman ,  RS  , P02028"]
["KEP Stanka ,  RS  , P02029"]
["RUS Milan ,  RS  , P02047"]
["HUDOKLIN Srečko ,  RS  , P02048"]
["UHAN Nejc ,  RS  , P02049"]
["BELE Mirko ,  RS  , P02050"]
["UHAN Blaž ,  RS  , P02052"]
["ZUPANČIČ Miran ,  DS  , P00103"]
["RIBIČ Jože ,  DS  , P00090"]
["JANC Aleš Mitja ,  RS  , P02085"]
["BOŽIČ Janko ,  RS  , P02086"]
["PROGAR Franc ,  DS  , P00101"]
["FERENČAK  Robert ,  MS  , A 5156"]
["SEČEN Ernest ,  DS  , P00089"]
["URH Vladimir ,  RS  , P02033"]
["UGRIN David ,  DS  , P00141"]
["FROLICH Stanislav ,  RS  , P02145"]
["ČAKARDIĆ Jurij ,  DS  , P00143"]
["SOVDAT Edi ,  DS  , P00159"]
["LAZAR Diego ,  RS  , P02066"]
["UDOVIČ Gorazd ,  DS  , P00086"]
["NABERGOJ Gašper ,  DS  , P00862"]
["FAJDIGA Petra ,  RS  , "]
["BOLA UJČIČ Denis ,  DS  , "]
["GRANDIČ Dejan ,  DS  , P00133"]
["FRAGIACOMO Branka ,  RS  , P02112"]
["LAMPREHT  Bojan ,  DS  , P00160"]
["RUDOLF Benjamina ,  DS  , P01910"]
["FRANK Aljoša ,  DS  , P00132"]
["RITOŠA Giuliano ,  MS  , A 5157"]

{"sheet":"clanice","index":5,"n_rows":119,"n_cols":1,"rows_kept":119,"cut":false,"hidden":true,"merged":[]}
["Izberite iz seznama"]
["Strelsko društvo SLOVENSKE KONJICE, Slovenske Konjice"]
["Strelsko društvo DOLIČ, Mislinja"]
["Strelsko društvo LJUBO ŠERCER, Ljubljana"]
["Klub za praktično streljanje BURJA Bač, Pivka"]
["Strelski klub BREŽICE, Brežice"]
["Strelsko društvo JOŽETA MIHEVCA IDRIJA, Idrija"]
["Strelski klub IZOLA, Izola"]
["Strelska družina KAMNIK, Kamnik"]
["Strelsko društvo TRIGLAV JAVORNIK - KOROŠKA BELA, Koroška Bela"]
["Strelska družina ANKARAN, Ankaran"]
["Strelsko društvo praktičnega streljanja SLOVENSKA BISTRICA, Slovenska Bistrica"]
["Občinska strelska zveza Kočevje, Kočevje"]
["Strelsko društvo PREDOSLJE, Kranj"]
["Strelski klub DEVETKA, Maribor"]
["Strelski klub RIBNICA, Ribnica"]
["Strelsko društvo LESKOVEC, Leskovec"]
["Strelsko društvo DUŠAN POŽENEL REČICA PRI LAŠKEM, Rečica pri Laškem"]
["Strelsko društvo FENIX, Maribor"]
["Strelsko društvo CELJSKA ČETA Mala Breza"]
["Strelsko društvo CELJE, Celje"]
["Strelsko društvo ŠMARTNO-LITIJA, Litija"]
["Strelsko društvo TELEKOM, Ljubljana"]
["Strelsko društvo TABOR-JEŽICA, Ljubljana"]
["Strelsko društvo POETOVIO,  Ptuj"]
["Strelsko društvo OLIMPIJA, Ljubljana"]
["Strelsko društvo trap ŠTEFAN KOVAČ MURSKA SOBOTA, Murska Sobota"]
["Strelsko društvo Rudar Presika, Ljutomer"]
["Strelsko društvo GORJANCI, Novo Mesto"]
["Strelski klub MORIS - KOČEVSKA REKA - KOČEVJE, Kočevska Reka"]
["Strelsko društvo trap ORMOŽ, Ormož"]
["Strelski klub MARIBOR, Maribor"]
["Strelsko društvo MESTO LJUTOMER, Ljutomer"]
["Strelsko društvo \"KOLOMAN FLISAR\" TIŠINA, Tišina"]
["Športno strelsko društvo MURSKA SOBOTA, Murska Sobota"]
["Strelsko društvo Trap Kungota, Kungota"]
["Strelsko društvo KOBRA LAŠKO, Laško"]
["Strelsko društvo ŠTEFAN KOVAČ TURNIŠČE, Turnišče"]
["Strelsko društvo ELEKTRO MARIBOR, Maribor"]
["Strelsko društvo FRANC LEŠNIK VUK HOTINJA VAS, Hotinja vas"]
["Strelsko društvo I. POHORSKI BATALJON RUŠE, Ruše"]
["Strelski klub KUNŠPERK, Bistrica ob Sotli"]
["Strelsko društvo JOŽE KERENČIČ MIKLAVŽ, Miklavž"]
["Strelsko društvo Fram"]
["Strelsko društvo SVEČINA, Zgornja Kungota"]
["Cerkniško društvo strelk in strelcev,  Cerknica"]
["Strelsko društvo SALONIT ANHOVO, Deskle"]
["Strelsko društvo KOVINAR ORMOŽ, Ormož"]
["Strelsko društvo \"SREDIŠČE\" SREDIŠČE OB DRAVI, Središče ob Dravi"]
["Strelsko društvo TOVARNE SLADKORJA ORMOŽ, Ormož"]
["Strelsko društvo IX. KORPUSA PIRAN, Piran"]
["Strelsko društvo PORTOROŽ, Portorož"]
["Strelsko društvo POSTOJNA, Postojna"]
["Združenje slovenskih častnikov Trbovlje"]
["Strelski klub PTUJ, Ptuj"]
["Strelsko društvo RADOVLJICA, Radovljica"]
["Občinsko združenje slovenskih častnikov Hrastnik, Hrastnik"]
["Strelsko društvo SOIT, Medvode"]
["Strelsko društvo IMPOL SLOVENSKA BISTRICA, Slovenska Bistrica"]
["Društvo za taktično streljanje Laško"]
["Lovska zveza Koper"]
["Strelsko društvo KALIBER, Fokovci"]
["Strelsko društvo MAROK SEVNICA, Sevnica"]
["Športno društvo ČRENŠOVCI, Črenšovci"]
["Strelski športni klub TOLMIN, Tolmin"]
["Strelsko društvo 1956 TRBOVLJE, Trbovlje"]
["ŠPORTNO REKREATIVNO DRUŠTVO BREZA,  Straža"]
["Strelsko društvo MROŽ VELENJE, Velenje"]
["Strelsko društvo \"JEZERO\" DOBROVNIK, Dobrovnik"]
["Strelsko društvo VRHNIKA, Vrhnika"]
["Strelsko društvo DOMŽALE, Domžale"]
["Strelsko društvo VREMŠČICA VREMSKI BRITOF, Famlje"]
["Športno strelski klub COAL PETIŠOVCI, Petišovci"]
["Strelsko društvo TRZIN, Trzin"]
["ŠPORTNO STRELSKO DRUŠTVO BURJA, Vipava"]
["Strelsko društvo KISOVEC, Zagorje"]
["Strelsko društvo LIBOJE, Petrovče"]
["Strelsko društvo PROARMIS"]
["Športno društvo Pohorski odred Maribor"]
["Območno združenje Slovenskih Častnikov Jesenice-Kranjska Gora"]
["Strelsko društvo ŠKOFJA LOKA, Škofja Loka"]
["Športno strelsko društvo RADGONA, Gornja Radgona"]
["Strelsko društvo JANKO JURKOVIČ VIDEM, Sveti Jurij ob Ščavnici"]
["Strelsko društvo GROSUPLJE, Grosuplje"]
["Strelsko društvo KOVINAR ŠTORE, Štore"]
["Strelsko društvo GANČANI, Beltinci"]
["Strelsko društvo KOVINOPLASTIKA LOŽ, Stari trg pri Ložu"]
["Strelsko društvo JOŽE KOVAČIČ ŠENTVID PRI STIČNI, Šentvid pri Stični"]
["Strelsko društvo SONJA VESEL IVANČNA GORICA, Ivančna Gorica"]
["Strelsko društvo RUDNIK HRASTNIK, Hrastnik"]
["Strelsko društvo POHORSKI BATALJON OPLOTNICA"]
["Strelsko društvo 4. JUNIJ ILIRSKA BISTRICA, Ilirska Bistrica"]
["Strelsko društvo PREDDVOR, Preddvor"]
["Strelsko društvo LENDAVA, Lendava"]
["Strelsko društvo TREBNJE, Trebnje"]
["Strelsko društvo GRANIČAR  Cankova"]
["Strelsko društvo KIDRIČEVO, Kidričevo"]
["Strelska družina VELKA, Zgornja Velka"]
["Strelsko društvo SAGITTARIUS, Novo mesto"]
["Strelsko društvo SEBEBORCI, Martanjci"]
["Strelsko društvo JURŠINCI, Juršinci"]
["Trap klub ILIRSKA BISTRICA, Ilirska Bistrica"]
["Strelsko društvo SVOBODA SEŽANA, Sežana"]
["Trap klub BRDA, Goriška Brda"]
["\"Trap\" strelski klub ZLD GORICA, Nova Gorica"]
["Strelsko društvo Radlje od Dravi"]
["Strelsko društvo ŽALEC, Žalec"]
["Strelsko društvo \"PANOVEC\", Nova Gorica"]
["Strelsko društvo OKROGAR SKVARČA, Zagorje ob Savi"]
["Strelsko društvo RUDAR GLOBOKO, Globoko"]
["Strelsko društvo GORENJA VAS, Gorenja vas"]
["Strelsko društvo \"KATJA\" TOMAŽ, Sveti Tomaž"]
["Strelsko društvo Lotrič ŽELEZNIKI, Železniki"]
["Športno društvo ZPE, Ljubljana"]
["Strelsko društvo POLICIST, Maribor"]
["Strelsko društvo SLOVENJ GRADEC, Slovenj Gradec"]
["Strelsko društvo BUKOVEC DOBREPOLJE, Videm-Dobrepolje"]
["Strelsko društvo POHORJE VITANJE, Vitanje"]
["Strelsko društvo VETERAN MARIBOR, Maribor"]