{"text_format":"1","workbook":"xlsx","n_sheets":6,"sheets":["Poročilo o izvedenem tekmovanju","PRIJAVA","2.DL PIŠTOLA","2.DL PUŠKA","sodniki","clanice"],"not_rendered":{"charts":0,"images":0,"macros":1,"external_links":0,"defined_names":2,"comments":0,"pivot_tables":0},"unopened":[],"bounds":{"document_bytes":16777216,"sheet_cells":100000,"rows_first":2000,"rows_last":500,"rows_between":2000,"halvings":0,"cell_chars":16384,"cell_head_chars":4096},"cells_cut":0,"cells_raw":0,"read":"whole","date_system":"1900"}

{"sheet":"Poročilo o izvedenem tekmovanju","index":0,"n_rows":96,"n_cols":10,"rows_kept":96,"cut":false,"hidden":false,"merged":[[0,1,0,10],[2,1,2,10],[7,2,7,3],[7,7,7,8],[27,2,27,8],[7,5,7,6],[9,7,9,9],[17,2,17,9],[19,2,19,9],[5,2,5,9],[12,2,12,9],[13,2,13,9],[14,2,14,9],[15,2,15,9],[16,2,16,9],[18,2,18,9],[42,2,42,3],[33,2,33,8],[40,2,40,4],[37,2,37,9],[34,2,34,8]]}
[null,"ZAPISNIK"]
[]
[null,"o izvedenem tekmovanju v streljanju z zračno puško in pištolo"]
[]
[]
[null,"Izvajalec (društvo): ","Strelska družina KAMNIK, Kamnik"]
[]
[null,"Datum:","2024-10-26",null,null,"Pričetek ob:",null,"08:00:00"]
[]
[null,"Streljalo se je na (število) : ",null,10,null,"elektronskih tarč",null,"stez z nosilci papirnatih tarč"]
[]
[]
[null,"Sodelujoča društva: ","Strelsko društvo DOMŽALE, Domžale"]
[null,null,"Strelska družina KAMNIK, Kamnik"]
[null,null,"Strelsko društvo TRZIN, Trzin"]
[null,null,"Strelsko društvo ŠKOFJA LOKA, Škofja Loka"]
[null,null,"Strelsko društvo GORENJA VAS, Gorenja vas"]
[null,null,"Strelsko društvo Lotrič ŽELEZNIKI, Železniki"]
[null,null,"Strelsko društvo PREDDVOR, Preddvor"]
[]
{"$rows_left_out":77}
{"sheet":"PRIJAVA","index":1,"n_rows":175,"n_cols":15,"rows_kept":175,"cut":false,"hidden":false,"merged":[[31,1,31,9],[31,12,31,13],[0,0,0,14]]}
["TEKMOVANJE: 2.DL, GSL, 4. SZ REGIJA"]
[]
[null,null,"ČASOVNICA",null,null,null,null,"DNE: 17.10, 24.10. in 26.10.2024","STRELIŠČE KAMNIK",null,null,null,"Strelov",null,"KATEGORIJA IN DISCIPLINA"]
[null,null,"DAN STRELJANJA","SKUPINA","KLIC","PRIPR. IN POSK. ČAS","START","STOP","SKUPAJ V SKUPINI"]
[null,null,"četrtek 17.10.",1,"16.50","17.00","17.15","17.40",10,null,null,null,20,null,"U11 MLAJŠI DEČKI - SERIJSKA PUŠKA"]
[null,null,"četrtek 17.10.",2,"17.50","18.00","18.15","18.40","10",null,null,null,20,null,"U11 MLAJŠE DEKLICE - SERIJSKA PUŠKA"]
[null,null,"četrtek 17.10.",3,"18.50","19.00","19.15","19.40","6",null,null,null,20,null,"U13 DEČKI - SERIJSKA PUŠKA"]
[null,null,null,null,null,null,null,null,null,null,null,null,20,null,"U13 DEKLICE - SERIJSKA PUŠKA"]
[null,null,"četrtek 24.10.",1,"13.35","13.45","14.00","14.50","2",null,null,null,20,null,"U15 STAREJŠI DEČKI - SERIJSKA PUŠKA"]
[null,null,"četrtek 24.10.",2,"16.00","16.10","16.25","17.15","8",null,null,null,20,null,"U15 STAREJŠE DEKLICE - SERIJSKA PUŠKA"]
[null,null,"četrtek 24.10.",3,"17.25","17.35","17.50","18.40","7",null,null,null,20,null,"U15 STAREJŠI DEČKI - PUŠKA"]
[null,null,"četrtek 24.10.",4,"18.50","19.00","19.15","20.05","10",null,null,null,20,null,"U15 STAREJŠE DEKLICE - PUŠKA"]
[null,null,null,null,null,null,null,null,null,null,null,null,20,null,"U15 STAREJŠI DEČKI - PIŠTOLA"]
[null,null,"sobota 26.10.",5,"8.00","8.10","8.25","9.15","8",null,null,null,20,null,"U15 STAREJŠE DEKLICE - PIŠTOLA"]
[null,null,"sobota 26.10.",6,"9.25","9.35","9.50","10.40","9",null,null,null,40,null,"U17 KADETI - PUŠKA"]
[null,null,"sobota 26.10.",7,"10.50","11.00","11.15","12.05","8",null,null,null,40,null,"U17 KADETINJE - PUŠKA"]
[null,null,"sobota 26.10.",8,"12.15","12.25","12.40","13.30","9",null,null,null,40,null,"U17 KADETI - PIŠTOLA"]
[null,null,"sobota 26.10.",9,"13.40","13.50","14.05","14.55","9",null,null,null,40,null,"U17 KADETINJE - PIŠTOLA"]
[null,null,"sobota 26.10.",10,"15.05","15.15","15.30","16.20","8",null,null,null,40,null,"U21 MLADINCI - PUŠKA"]
[null,null,"sobota 26.10.",11,"16.30","16.40","16.55","17.45","7",null,null,null,40,null,"U21 MLADINKE - PUŠKA"]
{"$rows_left_out":156}
{"sheet":"2.DL PIŠTOLA","index":2,"n_rows":105,"n_cols":31,"rows_kept":105,"cut":false,"hidden":false,"merged":[[1,0,1,30],[3,2,3,14],[4,0,6,0],[4,1,6,1],[4,2,4,14]]}
[]
["Iz zavihka Prijava se za tekmovalca v seznam za rezultate v stolpec E vpiše BIB številka od vrstice 5 dalje. Po vpisu BIB bo preneslo vse podatke v ta seznam, kjer se nato vpisujejo rezultati. Vpiše se rezultat serije v stolpec K, L, M, N  ter nc*. Prav tako se za upoštevanje rezultata ekipno vpišejo samo BIB številke v stolpcu T za vse tri člane ekipe, ki je lahko mešana. Prenos ostalih podatkov je samodejen.  Posamezno se lahko razvrsti, ekipno ostane nerazvrščeno. Dokument mora imeti omogočen makro."]
[]
[null,null,"II. LIGA PIŠTOLA 4. SZ REGIJA"]
["mesto",null,"SD KAMNIK"]
[]
[null,null,"Priimek in ime","Roj.skrita","BIB","Društvo, klub","1. ser","2. ser","3. ser","4. ser","1. ser","2. ser","3. ser","4. ser","skupno","nc*"]
[1,null,{"$f":"IF(E8=\"\",\"\",VLOOKUP(E8,PRIJAVA!$B$35:$H$240,2,FALSE) & \" \" & VLOOKUP(E8,PRIJAVA!$B$35:$H$240,3,FALSE))","v":"HUJIĆ Meldin"},{"$f":"IF(E8=\"\",\"\",VLOOKUP(E8,PRIJAVA!$B$35:$H$240,5,FALSE))","v":1997},15608,{"$f":"IF(E8=\"\",\"\",VLOOKUP(E8,PRIJAVA!$B$35:$H$240,7,FALSE))","v":"SD Gorenja vas"},null,null,null,null,87,94,92,93,{"$f":"SUM(G8:N8)","v":366},8,{"$f":"IF(C8=\"TONIČ Bojan\",\"!\",\"\")","v":""},null,null,null,"EKIPNO: "]
[2,null,{"$f":"IF(E9=\"\",\"\",VLOOKUP(E9,PRIJAVA!$B$35:$H$240,2,FALSE) & \" \" & VLOOKUP(E9,PRIJAVA!$B$35:$H$240,3,FALSE))","v":"CANKAR David"},null,10536,{"$f":"IF(E9=\"\",\"\",VLOOKUP(E9,PRIJAVA!$B$35:$H$240,7,FALSE))","v":"SD Gorenja vas"},null,null,null,null,83,95,95,88,361,6,{"$f":"IF(C9=\"TONIČ Bojan\",\"!\",\"\")","v":""}]
[3,null,{"$f":"IF(E10=\"\",\"\",VLOOKUP(E10,PRIJAVA!$B$35:$H$240,2,FALSE) & \" \" & VLOOKUP(E10,PRIJAVA!$B$35:$H$240,3,FALSE))","v":"BRENKUŠ Matjaž"},{"$f":"IF(E10=\"\",\"\",VLOOKUP(E10,PRIJAVA!$B$35:$H$240,5,FALSE))","v":1967},15197,{"$f":"IF(E10=\"\",\"\",VLOOKUP(E10,PRIJAVA!$B$35:$H$240,7,FALSE))","v":"SD Škofja Loka"},null,null,null,null,91,87,87,95,360,5,"",null,null,null,{"$f":"IF(T12=\"\",\"\",VLOOKUP(T12,PRIJAVA!$B$35:$H$240,7,FALSE))","v":"SD Trzin"}]
[4,null,{"$f":"IF(E11=\"\",\"\",VLOOKUP(E11,PRIJAVA!$B$35:$H$240,2,FALSE) & \" \" & VLOOKUP(E11,PRIJAVA!$B$35:$H$240,3,FALSE))","v":"KALIŠNIK Andraž"},{"$f":"IF(E11=\"\",\"\",VLOOKUP(E11,PRIJAVA!$B$35:$H$240,5,FALSE))","v":1994},15984,{"$f":"IF(E11=\"\",\"\",VLOOKUP(E11,PRIJAVA!$B$35:$H$240,7,FALSE))","v":"SD Trzin"},null,null,null,null,87,90,88,92,357,3,"",null,null,"BIB","Priimek in ime","1. ser","2. ser","3. ser","4. ser","1. ser","2. ser","3. ser","4. ser","skupno","nc*"]
[5,null,{"$f":"IF(E12=\"\",\"\",VLOOKUP(E12,PRIJAVA!$B$35:$H$240,2,FALSE) & \" \" & VLOOKUP(E12,PRIJAVA!$B$35:$H$240,3,FALSE))","v":"KOŠIR Branko"},{"$f":"IF(E12=\"\",\"\",VLOOKUP(E12,PRIJAVA!$B$35:$H$240,5,FALSE))","v":1964},10392,{"$f":"IF(E12=\"\",\"\",VLOOKUP(E12,PRIJAVA!$B$35:$H$240,7,FALSE))","v":"SD Lotrič Železniki"},null,null,null,null,92,88,89,87,356,5,"",null,null,13742,{"$f":"IF(T12=\"\",\"\",VLOOKUP(T12,PRIJAVA!$B$35:$H$240,2,FALSE) & \" \" & VLOOKUP(T12,PRIJAVA!$B$35:$H$240,3,FALSE))","v":"DAVIDOVIĆ Miroslav"},{"$f":"IF(U12=\"\",\"\",VLOOKUP(U12,$C$8:$N$106,5,FALSE))","v":0},{"$f":"IF(U12=\"\",\"\",VLOOKUP(U12,$C$8:$N$106,6,FALSE))","v":0},{"$f":"IF(U12=\"\",\"\",VLOOKUP(U12,$C$8:$N$106,7,FALSE))","v":0},{"$f":"IF(U12=\"\",\"\",VLOOKUP(U12,$C$8:$N$106,8,FALSE))","v":0},{"$f":"IF(U12=\"\",\"\",VLOOKUP(U12,$C$8:$N$106,9,FALSE))","v":90},{"$f":"IF(U12=\"\",\"\",VLOOKUP(U12,$C$8:$L$106,10,FALSE))","v":85},{"$f":"IF(V12=\"\",\"\",VLOOKUP(U12,$C$8:$M$106,11,FALSE))","v":91},{"$f":"IF(U12=\"\",\"\",VLOOKUP(U12,$C$8:$N$106,12,FALSE))","v":85},{"$f":"SUM(V12:AC12)","v":351},{"$f":"IF(U12=\"\",\"\",VLOOKUP(U12,$C$8:$P$106,14,FALSE))","v":7}]
[6,null,{"$f":"IF(E13=\"\",\"\",VLOOKUP(E13,PRIJAVA!$B$35:$H$240,2,FALSE) & \" \" & VLOOKUP(E13,PRIJAVA!$B$35:$H$240,3,FALSE))","v":"HABJAN  Andreja"},{"$f":"IF(E13=\"\",\"\",VLOOKUP(E13,PRIJAVA!$B$35:$H$240,5,FALSE))","v":0},10645,{"$f":"IF(E13=\"\",\"\",VLOOKUP(E13,PRIJAVA!$B$35:$H$240,7,FALSE))","v":"SD Trzin"},null,null,null,null,84,92,90,87,353,4,"",null,null,16621,{"$f":"IF(T13=\"\",\"\",VLOOKUP(T13,PRIJAVA!$B$35:$H$240,2,FALSE) & \" \" & VLOOKUP(T13,PRIJAVA!$B$35:$H$240,3,FALSE))","v":"LAPAJNE  Darka"},{"$f":"IF(U13=\"\",\"\",VLOOKUP(U13,$C$8:$N$106,5,FALSE))","v":0},{"$f":"IF(U13=\"\",\"\",VLOOKUP(U13,$C$8:$N$106,6,FALSE))","v":0},{"$f":"IF(U13=\"\",\"\",VLOOKUP(U13,$C$8:$N$106,7,FALSE))","v":0},{"$f":"IF(U13=\"\",\"\",VLOOKUP(U13,$C$8:$N$106,8,FALSE))","v":0},{"$f":"IF(U13=\"\",\"\",VLOOKUP(U13,$C$8:$N$106,9,FALSE))","v":85},{"$f":"IF(U13=\"\",\"\",VLOOKUP(U13,$C$8:$L$106,10,FALSE))","v":91},{"$f":"IF(V13=\"\",\"\",VLOOKUP(U13,$C$8:$M$106,11,FALSE))","v":84},{"$f":"IF(U13=\"\",\"\",VLOOKUP(U13,$C$8:$N$106,12,FALSE))","v":87},{"$f":"SUM(V13:AC13)","v":347},{"$f":"IF(U13=\"\",\"\",VLOOKUP(U13,$C$8:$P$106,14,FALSE))","v":3}]
[7,null,{"$f":"IF(E14=\"\",\"\",VLOOKUP(E14,PRIJAVA!$B$35:$H$240,2,FALSE) & \" \" & VLOOKUP(E14,PRIJAVA!$B$35:$H$240,3,FALSE))","v":"ZUPANC Aleksander"},{"$f":"IF(E14=\"\",\"\",VLOOKUP(E14,PRIJAVA!$B$35:$H$240,5,FALSE))","v":1992},16128,{"$f":"IF(E14=\"\",\"\",VLOOKUP(E14,PRIJAVA!$B$35:$H$240,7,FALSE))","v":"SD Lotrič Železniki"},null,null,null,null,88,86,91,88,353,2,"",null,null,10645,{"$f":"IF(T14=\"\",\"\",VLOOKUP(T14,PRIJAVA!$B$35:$H$240,2,FALSE) & \" \" & VLOOKUP(T14,PRIJAVA!$B$35:$H$240,3,FALSE))","v":"HABJAN  Andreja"},{"$f":"IF(U14=\"\",\"\",VLOOKUP(U14,$C$8:$N$106,5,FALSE))","v":0},{"$f":"IF(U14=\"\",\"\",VLOOKUP(U14,$C$8:$N$106,6,FALSE))","v":0},{"$f":"IF(U14=\"\",\"\",VLOOKUP(U14,$C$8:$N$106,7,FALSE))","v":0},{"$f":"IF(U14=\"\",\"\",VLOOKUP(U14,$C$8:$N$106,8,FALSE))","v":0},{"$f":"IF(U14=\"\",\"\",VLOOKUP(U14,$C$8:$N$106,9,FALSE))","v":84},{"$f":"IF(U14=\"\",\"\",VLOOKUP(U14,$C$8:$L$106,10,FALSE))","v":92},{"$f":"IF(V14=\"\",\"\",VLOOKUP(U14,$C$8:$M$106,11,FALSE))","v":90},{"$f":"IF(U14=\"\",\"\",VLOOKUP(U14,$C$8:$N$106,12,FALSE))","v":87},{"$f":"SUM(V14:AC14)","v":353},{"$f":"IF(U14=\"\",\"\",VLOOKUP(U14,$C$8:$P$106,14,FALSE))","v":4}]
[8,null,{"$f":"IF(E15=\"\",\"\",VLOOKUP(E15,PRIJAVA!$B$35:$H$240,2,FALSE) & \" \" & VLOOKUP(E15,PRIJAVA!$B$35:$H$240,3,FALSE))","v":"KUNC Tilen"},{"$f":"IF(E15=\"\",\"\",VLOOKUP(E15,PRIJAVA!$B$35:$H$240,5,FALSE))","v":2001},16320,{"$f":"IF(E15=\"\",\"\",VLOOKUP(E15,PRIJAVA!$B$35:$H$240,7,FALSE))","v":"SD Gorenja vas"},null,null,null,null,88,84,90,90,352,7,"",null,null,null,null,null,null,null,null,null,null,null,{"$f":"SUM(AC12:AC14)","v":259},{"$f":"SUM(AD12:AD14)","v":1051},{"$f":"SUM(AE12:AE14)","v":14}]
[9,null,{"$f":"IF(E16=\"\",\"\",VLOOKUP(E16,PRIJAVA!$B$35:$H$240,2,FALSE) & \" \" & VLOOKUP(E16,PRIJAVA!$B$35:$H$240,3,FALSE))","v":"DAVIDOVIĆ Miroslav"},{"$f":"IF(E16=\"\",\"\",VLOOKUP(E16,PRIJAVA!$B$35:$H$240,5,FALSE))","v":1971},13742,{"$f":"IF(E16=\"\",\"\",VLOOKUP(E16,PRIJAVA!$B$35:$H$240,7,FALSE))","v":"SD Trzin"},null,null,null,null,90,85,91,85,351,7,""]
[10,null,{"$f":"IF(E17=\"\",\"\",VLOOKUP(E17,PRIJAVA!$B$35:$H$240,2,FALSE) & \" \" & VLOOKUP(E17,PRIJAVA!$B$35:$H$240,3,FALSE))","v":"PRIMOŽIČ Taja"},{"$f":"IF(E17=\"\",\"\",VLOOKUP(E17,PRIJAVA!$B$35:$H$240,5,FALSE))","v":2009},16014,{"$f":"IF(E17=\"\",\"\",VLOOKUP(E17,PRIJAVA!$B$35:$H$240,7,FALSE))","v":"SD Lotrič Železniki"},null,null,null,null,88,87,87,87,349,4,""]
[11,null,{"$f":"IF(E18=\"\",\"\",VLOOKUP(E18,PRIJAVA!$B$35:$H$240,2,FALSE) & \" \" & VLOOKUP(E18,PRIJAVA!$B$35:$H$240,3,FALSE))","v":"LAPAJNE  Darka"},{"$f":"IF(E18=\"\",\"\",VLOOKUP(E18,PRIJAVA!$B$35:$H$240,5,FALSE))","v":1976},16621,{"$f":"IF(E18=\"\",\"\",VLOOKUP(E18,PRIJAVA!$B$35:$H$240,7,FALSE))","v":"SD Trzin"},null,null,null,null,85,91,84,87,347,3,"",null,null,null,{"$f":"IF(T20=\"\",\"\",VLOOKUP(T20,PRIJAVA!$B$35:$H$240,7,FALSE))","v":"SD Škofja Loka"}]
[12,null,{"$f":"IF(E19=\"\",\"\",VLOOKUP(E19,PRIJAVA!$B$35:$H$240,2,FALSE) & \" \" & VLOOKUP(E19,PRIJAVA!$B$35:$H$240,3,FALSE))","v":"TOLAR Žiga"},{"$f":"IF(E19=\"\",\"\",VLOOKUP(E19,PRIJAVA!$B$35:$H$240,5,FALSE))","v":2006},14903,{"$f":"IF(E19=\"\",\"\",VLOOKUP(E19,PRIJAVA!$B$35:$H$240,7,FALSE))","v":"SD Lotrič Železniki"},null,null,null,null,85,86,90,85,346,5,"",null,null,"BIB","Priimek in ime","1. ser","2. ser","3. ser","4. ser","1. ser","2. ser","3. ser","4. ser","skupno","nc*"]
[13,null,{"$f":"IF(E20=\"\",\"\",VLOOKUP(E20,PRIJAVA!$B$35:$H$240,2,FALSE) & \" \" & VLOOKUP(E20,PRIJAVA!$B$35:$H$240,3,FALSE))","v":"PRELEC Tomaž"},{"$f":"IF(E20=\"\",\"\",VLOOKUP(E20,PRIJAVA!$B$35:$H$240,5,FALSE))","v":1963},11107,{"$f":"IF(E20=\"\",\"\",VLOOKUP(E20,PRIJAVA!$B$35:$H$240,7,FALSE))","v":"SD Lotrič Železniki"},null,null,null,null,81,88,83,92,344,5,"",null,null,15198,{"$f":"IF(T20=\"\",\"\",VLOOKUP(T20,PRIJAVA!$B$35:$H$240,2,FALSE) & \" \" & VLOOKUP(T20,PRIJAVA!$B$35:$H$240,3,FALSE))","v":"HAFNAR Matjaž"},{"$f":"IF(U20=\"\",\"\",VLOOKUP(U20,$C$8:$N$106,5,FALSE))","v":0},{"$f":"IF(U20=\"\",\"\",VLOOKUP(U20,$C$8:$N$106,6,FALSE))","v":0},{"$f":"IF(U20=\"\",\"\",VLOOKUP(U20,$C$8:$N$106,7,FALSE))","v":0},{"$f":"IF(U20=\"\",\"\",VLOOKUP(U20,$C$8:$N$106,8,FALSE))","v":0},{"$f":"IF(U20=\"\",\"\",VLOOKUP(U20,$C$8:$N$106,9,FALSE))","v":81},{"$f":"IF(U20=\"\",\"\",VLOOKUP(U20,$C$8:$L$106,10,FALSE))","v":74},{"$f":"IF(V20=\"\",\"\",VLOOKUP(U20,$C$8:$M$106,11,FALSE))","v":84},{"$f":"IF(U20=\"\",\"\",VLOOKUP(U20,$C$8:$N$106,12,FALSE))","v":76},{"$f":"SUM(V20:AC20)","v":315},{"$f":"IF(U20=\"\",\"\",VLOOKUP(U20,$C$8:$P$106,14,FALSE))","v":1}]
{"$rows_left_out":86}
{"sheet":"2.DL PUŠKA","index":3,"n_rows":103,"n_cols":31,"rows_kept":103,"cut":false,"hidden":false,"merged":[[1,0,1,30],[3,2,3,14],[4,0,6,0],[4,1,6,1],[4,2,4,14]]}
[]
["Iz zavihka Prijava se za tekmovalca v seznam za rezultate v stolpec E vpiše BIB številka od vrstice 5 dalje. Po vpisu BIB bo preneslo vse podatke v ta seznam, kjer se nato vpisujejo rezultati. Vpiše se rezultat serije v stolpec K, L, M, N  ter nc*. Prav tako se za upoštevanje rezultata ekipno vpišejo samo BIB številke v stolpcu T za vse tri člane ekipe, ki je lahko mešana. Prenos ostalih podatkov je samodejen.  Posamezno se lahko razvrsti, ekipno ostane nerazvrščeno. Dokument mora imeti omogočen makro."]
[]
[null,null,"II. LIGA PUŠKA 4. SZ REGIJA"]
["mesto",null,"SD KAMNIK"]
[]
[null,null,"Priimek in ime","Roj.skrita","BIB","Društvo, klub","1. ser","2. ser","3. ser","4. ser","1. ser","2. ser","3. ser","4. ser","skupno","nc*"]
[1,null,{"$f":"IF(E8=\"\",\"\",VLOOKUP(E8,PRIJAVA!$B$35:$H$240,2,FALSE) & \" \" & VLOOKUP(E8,PRIJAVA!$B$35:$H$240,3,FALSE))","v":"JAKSETIČ Tristan"},{"$f":"IF(E8=\"\",\"\",VLOOKUP(E8,PRIJAVA!$B$35:$H$240,5,FALSE))","v":2010},15975,{"$f":"IF(E8=\"\",\"\",VLOOKUP(E8,PRIJAVA!$B$35:$H$240,7,FALSE))","v":"SD Kamnik"},null,null,null,null,96.6,98.3,94.5,97.1,{"$f":"SUM(G8:N8)","v":386.5},7,null,null,null,null,"EKIPNO: "]
[2,null,{"$f":"IF(E9=\"\",\"\",VLOOKUP(E9,PRIJAVA!$B$35:$H$240,2,FALSE) & \" \" & VLOOKUP(E9,PRIJAVA!$B$35:$H$240,3,FALSE))","v":"AHLIN Veronika"},{"$f":"IF(E9=\"\",\"\",VLOOKUP(E9,PRIJAVA!$B$35:$H$240,5,FALSE))","v":2008},14897,{"$f":"IF(E9=\"\",\"\",VLOOKUP(E9,PRIJAVA!$B$35:$H$240,7,FALSE))","v":"SD Kamnik"},null,null,null,null,103.6,99.6,101.4,102.9,407.5,22]
[3,null,{"$f":"IF(E10=\"\",\"\",VLOOKUP(E10,PRIJAVA!$B$35:$H$240,2,FALSE) & \" \" & VLOOKUP(E10,PRIJAVA!$B$35:$H$240,3,FALSE))","v":"JERMOL Gaber"},{"$f":"IF(E10=\"\",\"\",VLOOKUP(E10,PRIJAVA!$B$35:$H$240,5,FALSE))","v":2010},15693,{"$f":"IF(E10=\"\",\"\",VLOOKUP(E10,PRIJAVA!$B$35:$H$240,7,FALSE))","v":"SD Kamnik"},null,null,null,null,88.4,95.5,94.8,86,364.7,6,null,null,null,null,{"$f":"IF(T12=\"\",\"\",VLOOKUP(T12,PRIJAVA!$B$35:$H$240,7,FALSE))","v":"SD Kamnik"}]
[4,null,{"$f":"IF(E11=\"\",\"\",VLOOKUP(E11,PRIJAVA!$B$35:$H$240,2,FALSE) & \" \" & VLOOKUP(E11,PRIJAVA!$B$35:$H$240,3,FALSE))","v":"ČEMAŽAR Neža"},2008,15650,{"$f":"IF(E11=\"\",\"\",VLOOKUP(E11,PRIJAVA!$B$35:$H$240,7,FALSE))","v":"SD Lotrič Železniki"},null,null,null,null,86.9,98.2,98.3,95.2,378.6,14,null,null,null,"BIB","Priimek in ime","1. ser","2. ser","3. ser","4. ser","1. ser","2. ser","3. ser","4. ser","skupno","nc*"]
[5,null,{"$f":"IF(E12=\"\",\"\",VLOOKUP(E12,PRIJAVA!$B$35:$H$240,2,FALSE) & \" \" & VLOOKUP(E12,PRIJAVA!$B$35:$H$240,3,FALSE))","v":"KOBLAR Amadej"},{"$f":"IF(E12=\"\",\"\",VLOOKUP(E12,PRIJAVA!$B$35:$H$240,5,FALSE))","v":2007},14548,{"$f":"IF(E12=\"\",\"\",VLOOKUP(E12,PRIJAVA!$B$35:$H$240,7,FALSE))","v":"SD Lotrič Železniki"},null,null,null,null,93.2,95.5,94.2,93.6,376.5,9,null,null,null,15975,{"$f":"IF(T12=\"\",\"\",VLOOKUP(T12,PRIJAVA!$B$35:$H$240,2,FALSE) & \" \" & VLOOKUP(T12,PRIJAVA!$B$35:$H$240,3,FALSE))","v":"JAKSETIČ Tristan"},{"$f":"IF(U12=\"\",\"\",VLOOKUP(U12,$C$8:$N$106,5,FALSE))","v":0},{"$f":"IF(U12=\"\",\"\",VLOOKUP(U12,$C$8:$N$106,6,FALSE))","v":0},{"$f":"IF(U12=\"\",\"\",VLOOKUP(U12,$C$8:$N$106,7,FALSE))","v":0},{"$f":"IF(U12=\"\",\"\",VLOOKUP(U12,$C$8:$N$106,8,FALSE))","v":0},{"$f":"IF(U12=\"\",\"\",VLOOKUP(U12,$C$8:$N$106,9,FALSE))","v":96.6},{"$f":"IF(U12=\"\",\"\",VLOOKUP(U12,$C$8:$L$106,10,FALSE))","v":98.3},{"$f":"IF(V12=\"\",\"\",VLOOKUP(U12,$C$8:$M$106,11,FALSE))","v":94.5},{"$f":"IF(U12=\"\",\"\",VLOOKUP(U12,$C$8:$N$106,12,FALSE))","v":97.1},{"$f":"SUM(V12:AC12)","v":386.5},{"$f":"IF(U12=\"\",\"\",VLOOKUP(U12,$C$8:$P$106,14,FALSE))","v":7}]
[6,null,{"$f":"IF(E13=\"\",\"\",VLOOKUP(E13,PRIJAVA!$B$35:$H$240,2,FALSE) & \" \" & VLOOKUP(E13,PRIJAVA!$B$35:$H$240,3,FALSE))","v":"ŠUBIC Toni"},{"$f":"IF(E13=\"\",\"\",VLOOKUP(E13,PRIJAVA!$B$35:$H$240,5,FALSE))","v":2007},15788,{"$f":"IF(E13=\"\",\"\",VLOOKUP(E13,PRIJAVA!$B$35:$H$240,7,FALSE))","v":"SD Lotrič Železniki"},null,null,null,null,97.2,92.5,95.1,95.9,380.69999999999993,8,null,null,null,14897,{"$f":"IF(T13=\"\",\"\",VLOOKUP(T13,PRIJAVA!$B$35:$H$240,2,FALSE) & \" \" & VLOOKUP(T13,PRIJAVA!$B$35:$H$240,3,FALSE))","v":"AHLIN Veronika"},{"$f":"IF(U13=\"\",\"\",VLOOKUP(U13,$C$8:$N$106,5,FALSE))","v":0},{"$f":"IF(U13=\"\",\"\",VLOOKUP(U13,$C$8:$N$106,6,FALSE))","v":0},{"$f":"IF(U13=\"\",\"\",VLOOKUP(U13,$C$8:$N$106,7,FALSE))","v":0},{"$f":"IF(U13=\"\",\"\",VLOOKUP(U13,$C$8:$N$106,8,FALSE))","v":0},{"$f":"IF(U13=\"\",\"\",VLOOKUP(U13,$C$8:$N$106,9,FALSE))","v":103.6},{"$f":"IF(U13=\"\",\"\",VLOOKUP(U13,$C$8:$L$106,10,FALSE))","v":99.6},{"$f":"IF(V13=\"\",\"\",VLOOKUP(U13,$C$8:$M$106,11,FALSE))","v":101.4},{"$f":"IF(U13=\"\",\"\",VLOOKUP(U13,$C$8:$N$106,12,FALSE))","v":102.9},{"$f":"SUM(V13:AC13)","v":407.5},{"$f":"IF(U13=\"\",\"\",VLOOKUP(U13,$C$8:$P$106,14,FALSE))","v":22}]
[7,null,{"$f":"IF(E14=\"\",\"\",VLOOKUP(E14,PRIJAVA!$B$35:$H$240,2,FALSE) & \" \" & VLOOKUP(E14,PRIJAVA!$B$35:$H$240,3,FALSE))","v":"ZUPIN Nejc"},{"$f":"IF(E14=\"\",\"\",VLOOKUP(E14,PRIJAVA!$B$35:$H$240,5,FALSE))","v":2009},16215,{"$f":"IF(E14=\"\",\"\",VLOOKUP(E14,PRIJAVA!$B$35:$H$240,7,FALSE))","v":"SD Preddvor"},null,null,null,null,96.5,90.8,88.5,95.3,371.1,5,null,null,null,10313,{"$f":"IF(T14=\"\",\"\",VLOOKUP(T14,PRIJAVA!$B$35:$H$240,2,FALSE) & \" \" & VLOOKUP(T14,PRIJAVA!$B$35:$H$240,3,FALSE))","v":"FABJAN Boštjan"},{"$f":"IF(U14=\"\",\"\",VLOOKUP(U14,$C$8:$N$106,5,FALSE))","v":0},{"$f":"IF(U14=\"\",\"\",VLOOKUP(U14,$C$8:$N$106,6,FALSE))","v":0},{"$f":"IF(U14=\"\",\"\",VLOOKUP(U14,$C$8:$N$106,7,FALSE))","v":0},{"$f":"IF(U14=\"\",\"\",VLOOKUP(U14,$C$8:$N$106,8,FALSE))","v":0},{"$f":"IF(U14=\"\",\"\",VLOOKUP(U14,$C$8:$N$106,9,FALSE))","v":101.6},{"$f":"IF(U14=\"\",\"\",VLOOKUP(U14,$C$8:$L$106,10,FALSE))","v":101.1},{"$f":"IF(V14=\"\",\"\",VLOOKUP(U14,$C$8:$M$106,11,FALSE))","v":100.3},{"$f":"IF(U14=\"\",\"\",VLOOKUP(U14,$C$8:$N$106,12,FALSE))","v":99.2},{"$f":"SUM(V14:AC14)","v":402.2},{"$f":"IF(U14=\"\",\"\",VLOOKUP(U14,$C$8:$P$106,14,FALSE))","v":19}]
[8,null,{"$f":"IF(E15=\"\",\"\",VLOOKUP(E15,PRIJAVA!$B$35:$H$240,2,FALSE) & \" \" & VLOOKUP(E15,PRIJAVA!$B$35:$H$240,3,FALSE))","v":"GAŠPERLIN Lana"},{"$f":"IF(E15=\"\",\"\",VLOOKUP(E15,PRIJAVA!$B$35:$H$240,5,FALSE))","v":2008},15983,{"$f":"IF(E15=\"\",\"\",VLOOKUP(E15,PRIJAVA!$B$35:$H$240,7,FALSE))","v":"SD Preddvor"},null,null,null,null,98.9,95.5,93.8,90.2,378.4,8,null,null,null,null,null,null,null,null,null,null,null,null,{"$f":"SUM(AC12:AC14)","v":299.2},{"$f":"SUM(AD12:AD14)","v":1196.2},{"$f":"SUM(AE12:AE14)","v":48}]
[9,null,{"$f":"IF(E16=\"\",\"\",VLOOKUP(E16,PRIJAVA!$B$35:$H$240,2,FALSE) & \" \" & VLOOKUP(E16,PRIJAVA!$B$35:$H$240,3,FALSE))","v":"RAJGELJ Sergej"},{"$f":"IF(E16=\"\",\"\",VLOOKUP(E16,PRIJAVA!$B$35:$H$240,5,FALSE))","v":2005},13844,{"$f":"IF(E16=\"\",\"\",VLOOKUP(E16,PRIJAVA!$B$35:$H$240,7,FALSE))","v":"SD Preddvor"},null,null,null,null,96.3,93.4,90.2,95.6,375.5,8]
[10,null,{"$f":"IF(E17=\"\",\"\",VLOOKUP(E17,PRIJAVA!$B$35:$H$240,2,FALSE) & \" \" & VLOOKUP(E17,PRIJAVA!$B$35:$H$240,3,FALSE))","v":"AHAČIČ SREDNIK Nika"},{"$f":"IF(E17=\"\",\"\",VLOOKUP(E17,PRIJAVA!$B$35:$H$240,5,FALSE))","v":1960},14863,{"$f":"IF(E17=\"\",\"\",VLOOKUP(E17,PRIJAVA!$B$35:$H$240,7,FALSE))","v":"SD Lotrič Železniki"},null,null,null,null,84.9,96.8,93,92.9,367.6,8]
[11,null,{"$f":"IF(E18=\"\",\"\",VLOOKUP(E18,PRIJAVA!$B$35:$H$240,2,FALSE) & \" \" & VLOOKUP(E18,PRIJAVA!$B$35:$H$240,3,FALSE))","v":"GRAŠIČ Lovro"},{"$f":"IF(E18=\"\",\"\",VLOOKUP(E18,PRIJAVA!$B$35:$H$240,5,FALSE))","v":2008},16229,{"$f":"IF(E18=\"\",\"\",VLOOKUP(E18,PRIJAVA!$B$35:$H$240,7,FALSE))","v":"SD Škofja Loka"},null,null,null,null,93.5,93.8,96.1,97.8,381.2,6,null,null,null,null,{"$f":"IF(T20=\"\",\"\",VLOOKUP(T20,PRIJAVA!$B$35:$H$240,7,FALSE))","v":"SD Preddvor"}]
[12,null,{"$f":"IF(E19=\"\",\"\",VLOOKUP(E19,PRIJAVA!$B$35:$H$240,2,FALSE) & \" \" & VLOOKUP(E19,PRIJAVA!$B$35:$H$240,3,FALSE))","v":"GABER Luka"},{"$f":"IF(E19=\"\",\"\",VLOOKUP(E19,PRIJAVA!$B$35:$H$240,5,FALSE))","v":2008},14600,{"$f":"IF(E19=\"\",\"\",VLOOKUP(E19,PRIJAVA!$B$35:$H$240,7,FALSE))","v":"SD Škofja Loka"},null,null,null,null,100.6,99.4,102.2,99.8,402,20,null,null,null,"BIB","Priimek in ime","1. ser","2. ser","3. ser","4. ser","1. ser","2. ser","3. ser","4. ser","skupno","nc*"]
[13,null,{"$f":"IF(E20=\"\",\"\",VLOOKUP(E20,PRIJAVA!$B$35:$H$240,2,FALSE) & \" \" & VLOOKUP(E20,PRIJAVA!$B$35:$H$240,3,FALSE))","v":"KOPRIVNIKAR Žiga"},{"$f":"IF(E20=\"\",\"\",VLOOKUP(E20,PRIJAVA!$B$35:$H$240,5,FALSE))","v":2008},14599,{"$f":"IF(E20=\"\",\"\",VLOOKUP(E20,PRIJAVA!$B$35:$H$240,7,FALSE))","v":"SD Škofja Loka"},null,null,null,null,95.6,86.3,94.5,95,371.4,5,null,null,null,16215,{"$f":"IF(T20=\"\",\"\",VLOOKUP(T20,PRIJAVA!$B$35:$H$240,2,FALSE) & \" \" & VLOOKUP(T20,PRIJAVA!$B$35:$H$240,3,FALSE))","v":"ZUPIN Nejc"},{"$f":"IF(U20=\"\",\"\",VLOOKUP(U20,$C$8:$N$106,5,FALSE))","v":0},{"$f":"IF(U20=\"\",\"\",VLOOKUP(U20,$C$8:$N$106,6,FALSE))","v":0},{"$f":"IF(U20=\"\",\"\",VLOOKUP(U20,$C$8:$N$106,7,FALSE))","v":0},{"$f":"IF(U20=\"\",\"\",VLOOKUP(U20,$C$8:$N$106,8,FALSE))","v":0},{"$f":"IF(U20=\"\",\"\",VLOOKUP(U20,$C$8:$N$106,9,FALSE))","v":96.5},{"$f":"IF(U20=\"\",\"\",VLOOKUP(U20,$C$8:$L$106,10,FALSE))","v":90.8},{"$f":"IF(V20=\"\",\"\",VLOOKUP(U20,$C$8:$M$106,11,FALSE))","v":88.5},{"$f":"IF(U20=\"\",\"\",VLOOKUP(U20,$C$8:$N$106,12,FALSE))","v":95.3},{"$f":"SUM(V20:AC20)","v":371.1},{"$f":"IF(U20=\"\",\"\",VLOOKUP(U20,$C$8:$P$106,14,FALSE))","v":5}]
{"$rows_left_out":84}
{"sheet":"sodniki","index":4,"n_rows":168,"n_cols":1,"rows_kept":168,"cut":false,"hidden":true,"merged":[]}
["Izberite iz seznama"]
["KOPINJA Jože ,  DS  , P02006"]
["SLANIČ Davorin ,  DS  , P01890"]
["MAKARI Igor ,  DS  , P02004"]
["CIGLAR Tomaž ,  RS  , P02130"]
["JERIČ Boštjan ,  RS  , P02131"]
["KELENC  Janez ,  MS  , B 8087"]
["KELENC Žan ,  DS  , P02003"]
["GOLOB Irena ,  MS  , B 8086"]
["GOLOB Enea ,  DS  , P02017"]
["ČUČKO Aljaž ,  RS  , P02102"]
["DRAŠKOVIČ Božidar ,  RS  , P02140"]
["MAUČEC  Jože ,  RS  , P01933"]
["MAUČEC Gregor ,  DS  , P01935"]
["BALAŠKO Štefan ,  DS  , P01931"]
["ŽALIK Avgust ,  RS  , P01932"]
["KOSI Mladen ,  DS  , P01962"]
["KRIŽANIČ Toni ,  DS  , P00034"]
["NAGY Robert ,  RS  , P02002"]
["ŠTAMAN Vasja ,  DS  , P01963"]
{"$rows_left_out":149}
{"sheet":"clanice","index":5,"n_rows":119,"n_cols":1,"rows_kept":119,"cut":false,"hidden":true,"merged":[]}
["Izberite iz seznama"]
["Strelsko društvo SLOVENSKE KONJICE, Slovenske Konjice"]
["Strelsko društvo DOLIČ, Mislinja"]
["Strelsko društvo LJUBO ŠERCER, Ljubljana"]
["Klub za praktično streljanje BURJA Bač, Pivka"]
["Strelski klub BREŽICE, Brežice"]
["Strelsko društvo JOŽETA MIHEVCA IDRIJA, Idrija"]
["Strelski klub IZOLA, Izola"]
["Strelska družina KAMNIK, Kamnik"]
["Strelsko društvo TRIGLAV JAVORNIK - KOROŠKA BELA, Koroška Bela"]
["Strelska družina ANKARAN, Ankaran"]
["Strelsko društvo praktičnega streljanja SLOVENSKA BISTRICA, Slovenska Bistrica"]
["Občinska strelska zveza Kočevje, Kočevje"]
["Strelsko društvo PREDOSLJE, Kranj"]
["Strelski klub DEVETKA, Maribor"]
["Strelski klub RIBNICA, Ribnica"]
["Strelsko društvo LESKOVEC, Leskovec"]
["Strelsko društvo DUŠAN POŽENEL REČICA PRI LAŠKEM, Rečica pri Laškem"]
["Strelsko društvo FENIX, Maribor"]
["Strelsko društvo CELJSKA ČETA Mala Breza"]
{"$rows_left_out":99}